program: Orca
programVersion: 5.0.2
elementType: Cl Cl O O O N N C C C C C C C C C C C C C C C C C C C C H H H H H H H H H H H H H H H H
charge: 0
multiplicity: 1
keywords: wb97x-d3
keywords: def2-TZVPP
keywords: def2/J RIJCOSX
keywords: DEFGRID2
keywords: scfconv7
keywords: smallprint printgap noloewdin
keywords: NOSOSCF
formula: C20H16Cl2N2O3
InChI: InChI=1/C20H16Cl2N2O3/c1-12-18(19(26)15-9-8-14(21)10-16(15)22)20(24(2)23-12)27-11-17(25)13-6-4-3-5-7-13/h3-10H,11H2,1-2H3
43 atoms
Cl 2.392026 -2.16043 -1.255412
Cl 2.96275 3.085573 -2.175289
O  -1.007446 -1.457965 -1.184394
O  1.572082 -1.374833 2.520333
O  -2.623035 -0.231618 0.650667
N  -1.677974 -3.24515 0.034825
N  -1.412374 -3.972281 1.135079
C  -0.017044 -2.203651 1.024929
C  -0.880044 -2.184927 -0.07772
C  -0.431979 -3.361373 1.749153
C  1.052598 -1.3201 1.417751
C  1.534963 -0.260589 0.476972
C  0.116655 -3.918934 3.012421
C  -2.758828 -3.609245 -0.849387
C  -1.16503 -0.0531 -1.210241
C  -1.994295 0.503818 -0.075909
C  2.151443 -0.528559 -0.73898
C  1.415441 1.066914 0.878356
C  -1.979848 1.974821 0.106609
C  2.607432 0.492186 -1.559045
C  1.84377 2.105357 0.071509
C  2.43173 1.803638 -1.146548
C  -2.428274 2.503431 1.317421
C  -1.507485 2.836335 -0.884122
C  -2.385077 3.86915 1.539444
C  -1.482869 4.204332 -0.665565
C  -1.913786 4.721315 0.548534
H  1.186845 -4.112826 2.93656
H  -0.030151 -3.240717 3.852925
H  -0.382271 -4.859124 3.244453
H  -2.391646 -3.860717 -1.843077
H  -3.251174 -4.479917 -0.427435
H  -3.482575 -2.799413 -0.928107
H  -0.199288 0.446986 -1.262037
H  -1.678785 0.164382 -2.151307
H  0.953184 1.295327 1.830194
H  3.089848 0.266147 -2.500252
H  1.717943 3.130792 0.389989
H  -2.790732 1.84479 2.095959
H  -1.157497 2.456276 -1.835279
H  -2.717425 4.270913 2.487507
H  -1.12051 4.865563 -1.441497
H  -1.881283 5.789032 0.723338
elementType: Cl O N C H
totalener: -2027.44878166 hartree
nucrepener: 2850.94278630 hartree
electener: -4878.39156795 hartree
oneelecener: -8448.64716571 hartree
twoeener: 3570.25559776 hartree
cpcmener: -0.03675707 hartree
kineticenergy: 2021.49229625 hartree
xcener: -148.640270201633 hartree
chargesum: 0.0000000
charge: -0.061081 -0.074657 -0.346278 -0.443018 -0.405829 0.145891 -0.338755 -0.216052 0.242460 0.075977 0.384346 0.049113 -0.258016 -0.163034 0.078494 0.352104 0.027572 -0.126452 -0.003640 -0.143044 -0.227668 0.145022 -0.151785 -0.185542 -0.155259 -0.160079 -0.112431 0.101296 0.099244 0.095836 0.120186 0.112327 0.114813 0.080523 0.160198 0.150053 0.125413 0.145015 0.143177 0.142934 0.159820 0.158954 0.161852
qa: -0.0611 -0.0747 -0.3463 -0.4430 -0.4058 0.1459 -0.3388 -0.2161 0.2425 0.0760 0.3843 0.0491 -0.2580 -0.1630 0.0785 0.3521 0.0276 -0.1265 -0.0036 -0.1430 -0.2277 0.1450 -0.1518 -0.1855 -0.1553 -0.1601 -0.1124 0.1013 0.0992 0.0958 0.1202 0.1123 0.1148 0.0805 0.1602 0.1501 0.1254 0.1450 0.1432 0.1429 0.1598 0.1590 0.1619
va: 1.2579 1.2297 2.0863 2.0541 2.0587 3.2955 2.9350 3.4637 4.0766 4.0086 3.8970 3.4164 3.9550 3.8916 3.8524 3.8223 3.9046 3.9175 3.5624 4.0589 3.9991 3.8197 3.9615 3.9176 3.9270 3.9029 3.8953 0.9974 1.0007 1.0161 0.9885 1.0110 0.9980 1.0060 0.9912 1.0066 1.0223 1.0089 1.0230 1.0044 0.9919 0.9931 0.9878
dispcorr: -0.028487473 hartree
energy: -2027.477269129564
dipole: -21.41204 20.37021 -1.04184 0.15713 2.57792 2.73505 9.76793 -12.01511 -2.24718
magnitude: 3.68994 au
magnitude: 9.37909 debye
