program: Orca
programVersion: 5.0.2
elementType: Cl Cl O O O N N C C C C C C C C C C C C C C C C C C C C H H H H H H H H H H H H H H H H
charge: 0
multiplicity: 1
keywords: wb97x-d3
keywords: def2-TZVPP
keywords: def2/J RIJCOSX
keywords: DEFGRID2
keywords: scfconv7
keywords: smallprint printgap noloewdin
keywords: NOSOSCF
formula: C20H16Cl2N2O3
InChI: InChI=1/C20H16Cl2N2O3/c1-12-18(19(26)15-9-8-14(21)10-16(15)22)20(24(2)23-12)27-11-17(25)13-6-4-3-5-7-13/h3-10H,11H2,1-2H3
43 atoms
Cl 2.470078 -2.204804 -1.005118
Cl 3.176594 2.999002 -2.04371
O  -0.898963 -1.432026 -1.242576
O  1.333812 -1.286152 2.670955
O  -2.678625 -0.228892 0.454565
N  -1.658963 -3.221924 -0.078383
N  -1.497269 -3.931095 1.053628
C  -0.109848 -2.153203 1.053554
C  -0.863468 -2.155386 -0.126384
C  -0.587456 -3.301838 1.752313
C  0.922964 -1.262824 1.522676
C  1.504348 -0.240923 0.596835
C  -0.17013 -3.827398 3.077886
C  -2.637167 -3.613768 -1.063925
C  -1.069508 -0.028263 -1.276336
C  -1.999708 0.515756 -0.21538
C  2.207538 -0.555356 -0.560047
C  1.379784 1.099915 0.949992
C  -2.021811 1.986264 -0.028601
C  2.738307 0.433203 -1.374113
C  1.883708 2.106885 0.146734
C  2.552755 1.758998 -1.016141
C  -1.455631 2.85799 -0.95974
C  -2.612391 2.505738 1.1240
C  -1.481161 4.225896 -0.74054
C  -2.620473 3.871622 1.348274
C  -2.057031 4.733657 0.415675
H  0.904744 -4.002536 3.124468
H  -0.419927 -3.136188 3.882982
H  -0.676382 -4.771668 3.274457
H  -3.172862 -4.473625 -0.673981
H  -3.34808 -2.809096 -1.244912
H  -2.163446 -3.892267 -2.003943
H  -0.108265 0.482051 -1.241912
H  -1.501238 0.189815 -2.25752
H  0.851524 1.364203 1.857171
H  3.286506 0.171723 -2.268915
H  1.752859 3.143361 0.424901
H  -0.996074 2.486559 -1.866669
H  -3.050728 1.840295 1.856347
H  -1.046011 4.894884 -1.471115
H  -3.065881 4.2658 2.252176
H  -2.065172 5.801604 0.591679
elementType: Cl O N C H
totalener: -2027.44907822 hartree
nucrepener: 2847.60630718 hartree
electener: -4875.05538540 hartree
oneelecener: -8441.99521284 hartree
twoeener: 3566.93982744 hartree
cpcmener: -0.03688526 hartree
kineticenergy: 2021.49268059 hartree
xcener: -148.640281791703 hartree
chargesum: 0.0000000
charge: -0.060889 -0.074576 -0.346010 -0.443160 -0.406024 0.146471 -0.338502 -0.211824 0.235524 0.077505 0.383354 0.052126 -0.259375 -0.163931 0.079956 0.354018 0.026951 -0.126663 -0.004076 -0.142188 -0.225991 0.144768 -0.189540 -0.151318 -0.157294 -0.156812 -0.112574 0.101019 0.100026 0.095631 0.112816 0.114839 0.120847 0.077596 0.161115 0.149250 0.125333 0.144304 0.142780 0.143472 0.159120 0.159851 0.162074
qa: -0.0609 -0.0746 -0.3460 -0.4432 -0.4060 0.1465 -0.3385 -0.2118 0.2355 0.0775 0.3834 0.0521 -0.2594 -0.1639 0.0800 0.3540 0.0270 -0.1267 -0.0041 -0.1422 -0.2260 0.1448 -0.1895 -0.1513 -0.1573 -0.1568 -0.1126 0.1010 0.1000 0.0956 0.1128 0.1148 0.1208 0.0776 0.1611 0.1492 0.1253 0.1443 0.1428 0.1435 0.1591 0.1599 0.1621
va: 1.2578 1.2296 2.0850 2.0540 2.0590 3.2972 2.9349 3.4513 4.0783 4.0055 3.8982 3.4038 3.9568 3.8916 3.8541 3.8205 3.9080 3.9153 3.5581 4.0606 4.0021 3.8193 3.9197 3.9647 3.9027 3.9287 3.8983 0.9976 0.9999 1.0162 1.0108 0.9979 0.9883 1.0084 0.9907 1.0070 1.0222 1.0091 1.0045 1.0232 0.9928 0.9920 0.9876
dispcorr: -0.028246645 hartree
energy: -2027.477324865769
dipole: -22.36453 21.51904 -0.84549 0.61799 2.09943 2.71742 8.23581 -10.58674 -2.35093
magnitude: 3.69135 au
magnitude: 9.38267 debye
