program: Orca
programVersion: 5.0.2
elementType: Cl Cl O O O N N C C C C C C C C C C C C C C C C C C C C H H H H H H H H H H H H H H H H
charge: 0
multiplicity: 1
keywords: wb97x-d3
keywords: def2-TZVPP
keywords: def2/J RIJCOSX
keywords: DEFGRID2
keywords: scfconv7
keywords: smallprint printgap noloewdin
keywords: NOSOSCF
formula: C20H16Cl2N2O3
InChI: InChI=1/C20H16Cl2N2O3/c1-12-18(19(26)15-9-8-14(21)10-16(15)22)20(24(2)23-12)27-11-17(25)13-6-4-3-5-7-13/h3-10H,11H2,1-2H3
43 atoms
Cl 0.416527 1.800592 -1.987742
Cl 4.405135 2.094292 1.546755
O  -0.43178 -1.632133 1.7200
O  0.390478 -1.168636 -2.676249
O  -2.7905 -0.630969 0.806309
N  -1.343878 -3.482656 0.771501
N  -1.491367 -4.146503 -0.388167
C  -0.319803 -2.250005 -0.732182
C  -0.658435 -2.351068 0.621483
C  -0.906006 -3.417958 -1.304768
C  0.45094 -1.264266 -1.463809
C  1.400285 -0.394042 -0.705667
C  -0.885901 -3.871471 -2.720093
C  -1.937829 -3.976386 1.990001
C  -0.65147 -0.233953 1.747564
C  -1.926604 0.183985 1.040512
C  1.487864 0.983021 -0.910843
C  2.27918 -0.981025 0.200834
C  -2.041821 1.600951 0.631019
C  2.39949 1.755792 -0.209533
C  3.214908 -0.233556 0.893544
C  3.259156 1.134509 0.682488
C  -2.992412 1.943503 -0.330831
C  -1.205091 2.588568 1.150996
C  -3.087145 3.248165 -0.782079
C  -1.315883 3.897331 0.711724
C  -2.24884 4.226388 -0.261871
H  -1.44123 -3.193504 -3.368372
H  0.129615 -3.933659 -3.1122
H  -1.33952 -4.858831 -2.795834
H  -2.481636 -4.884228 1.748029
H  -1.178139 -4.210458 2.734108
H  -2.633681 -3.248231 2.4042
H  -0.737713 0.03235 2.804859
H  0.211118 0.302134 1.355772
H  2.241948 -2.051064 0.360665
H  2.439024 2.825769 -0.36111
H  3.893428 -0.71297 1.585344
H  -3.642071 1.182983 -0.744423
H  -0.467544 2.353585 1.90762
H  -3.812389 3.503299 -1.543626
H  -0.667785 4.6593 1.12417
H  -2.322061 5.245984 -0.61795
elementType: Cl O N C H
totalener: -2027.44887745 hartree
nucrepener: 2857.33834451 hartree
electener: -4884.78722196 hartree
oneelecener: -8461.75955542 hartree
twoeener: 3576.97233346 hartree
cpcmener: -0.03746621 hartree
kineticenergy: 2021.49515032 hartree
xcener: -148.639828969260 hartree
chargesum: 0.0000000
charge: -0.056968 -0.073333 -0.346108 -0.423474 -0.407110 0.139117 -0.336475 -0.142314 0.203790 0.084469 0.294115 0.052630 -0.258521 -0.161043 0.070489 0.348369 0.058485 -0.167985 0.001715 -0.173408 -0.139409 0.118063 -0.150606 -0.191719 -0.154904 -0.150721 -0.122783 0.099428 0.102537 0.096414 0.112709 0.120392 0.112832 0.161010 0.080428 0.158814 0.123659 0.148010 0.142781 0.145695 0.159607 0.159680 0.161638
qa: -0.0570 -0.0733 -0.3461 -0.4235 -0.4071 0.1391 -0.3365 -0.1423 0.2038 0.0845 0.2941 0.0526 -0.2585 -0.1610 0.0705 0.3484 0.0585 -0.1680 0.0017 -0.1734 -0.1394 0.1181 -0.1506 -0.1917 -0.1549 -0.1507 -0.1228 0.0994 0.1025 0.0964 0.1127 0.1204 0.1128 0.1610 0.0804 0.1588 0.1237 0.1480 0.1428 0.1457 0.1596 0.1597 0.1616
va: 1.2602 1.2307 2.0791 2.0614 2.0601 3.3051 2.9359 3.4250 4.1211 3.9871 3.9733 3.3837 3.9501 3.8901 3.8394 3.8414 3.9588 3.9291 3.5370 4.0581 3.9982 3.8710 3.9702 3.9251 3.9208 3.9029 3.9019 1.0010 0.9972 1.0157 1.0108 0.9883 1.0006 0.9898 1.0143 0.9960 1.0250 1.0037 1.0217 1.0020 0.9914 0.9910 0.9874
dispcorr: -0.028323800 hartree
energy: -2027.477201250190
dipole: -17.78376 18.45521 0.67145 -11.88730 13.40957 1.52228 4.04726 -1.35611 2.69116
magnitude: 3.16394 au
magnitude: 8.04209 debye
