program: Orca
programVersion: 5.0.2
elementType: Cl Cl O O O N N C C C C C C C C C C C C C C C C C C C C H H H H H H H H H H H H H H H H
charge: 0
multiplicity: 1
keywords: wb97x-d3
keywords: def2-TZVPP
keywords: def2/J RIJCOSX
keywords: DEFGRID2
keywords: scfconv7
keywords: smallprint printgap noloewdin
keywords: NOSOSCF
formula: C20H16Cl2N2O3
InChI: InChI=1/C20H16Cl2N2O3/c1-12-18(19(26)15-9-8-14(21)10-16(15)22)20(24(2)23-12)27-11-17(25)13-6-4-3-5-7-13/h3-10H,11H2,1-2H3
43 atoms
Cl 2.47654 -2.261617 -2.030926
Cl 6.39674 0.480977 0.389625
O  -2.542955 -1.179089 -0.898593
O  0.078429 0.432367 -1.568782
O  -3.497041 0.088923 1.273085
N  -1.810934 -2.608701 0.715782
N  -0.725489 -2.980631 1.415288
C  -0.205542 -1.264368 0.045071
C  -1.562053 -1.59111 -0.102641
C  0.244765 -2.19023 1.038344
C  0.547364 -0.297969 -0.71618
C  2.013356 -0.153737 -0.41595
C  1.587345 -2.366862 1.660231
C  -3.075012 -3.268787 0.923134
C  -2.833184 0.195384 -1.005255
C  -3.372966 0.774861 0.288536
C  2.970811 -0.966207 -1.002289
C  2.439702 0.874481 0.413932
C  -3.736888 2.216724 0.286202
C  4.323166 -0.781358 -0.764073
C  3.783453 1.077317 0.67535
C  4.716507 0.242962 0.080199
C  -3.543893 3.031731 -0.828431
C  -4.290945 2.765633 1.442223
C  -3.898723 4.370281 -0.787558
C  -4.644762 4.101869 1.48138
C  -4.448913 4.906383 0.366364
H  1.979132 -1.437432 2.07097
H  1.50555 -3.091455 2.468044
H  2.319737 -2.744342 0.947227
H  -2.933311 -3.988832 1.722114
H  -3.83557 -2.547689 1.212668
H  -3.39793 -3.792316 0.024478
H  -1.957086 0.752875 -1.343806
H  -3.597114 0.274385 -1.782765
H  1.705426 1.52472 0.871907
H  5.055079 -1.425236 -1.230527
H  4.102438 1.876887 1.328673
H  -3.107941 2.639356 -1.737784
H  -4.43994 2.135105 2.308318
H  -3.742581 4.994605 -1.656852
H  -5.073508 4.519763 2.382339
H  -4.724265 5.952302 0.39815
totalener: -2027.42753504 hartree
nucrepener: 2676.88220607 hartree
electener: -4704.30974111 hartree
oneelecener: -8100.87931190 hartree
twoeener: 3396.56957079 hartree
kineticenergy: 2021.55688023 hartree
xcener: -148.644376482160 hartree
chargesum: 0.0000000
charge: -0.052129 -0.065551 -0.309162 -0.381478 -0.353395 0.129138 -0.290012 -0.235686 0.247321 0.109625 0.355220 0.099828 -0.285247 -0.176137 -0.050021 0.355206 -0.009224 -0.158055 -0.051481 -0.156093 -0.139714 0.100162 -0.146365 -0.121981 -0.142682 -0.126467 -0.092694 0.100426 0.111463 0.103414 0.113169 0.117386 0.109655 0.144634 0.130944 0.122094 0.115986 0.124101 0.120750 0.138687 0.130721 0.130804 0.132838
qa: -0.0521 -0.0656 -0.3092 -0.3815 -0.3534 0.1291 -0.2900 -0.2357 0.2473 0.1096 0.3552 0.0998 -0.2852 -0.1761 -0.0500 0.3552 -0.0092 -0.1581 -0.0515 -0.1561 -0.1397 0.1002 -0.1464 -0.1220 -0.1427 -0.1265 -0.0927 0.1004 0.1115 0.1034 0.1132 0.1174 0.1097 0.1446 0.1309 0.1221 0.1160 0.1241 0.1207 0.1387 0.1307 0.1308 0.1328
va: 1.2655 1.2384 2.1309 2.1010 2.1159 3.3272 2.9257 3.5143 4.1236 3.9132 3.8965 3.5568 3.9873 3.8924 3.8602 3.7835 4.0224 3.9948 3.6962 4.0853 4.0082 3.9333 3.9810 4.0064 4.0038 3.9553 3.9505 0.9876 1.0208 0.9940 1.0127 1.0037 0.9886 1.0156 0.9992 1.0113 1.0243 1.0120 1.0132 1.0261 1.0024 1.0018 0.9976
dispcorr: -0.023584789 hartree
energy: -2027.451119831858
dipole: -31.13561 30.03313 -1.10248 7.82763 -6.72343 1.10420 9.76103 -9.63696 0.12407
magnitude: 1.56528 au
magnitude: 3.97862 debye
