program: Orca
programVersion: 5.0.2
elementType: Cl Cl O O O N N C C C C C C C C C C C C C C C C C C C C H H H H H H H H H H H H H H H H
charge: 0
multiplicity: 1
keywords: wb97x-d3
keywords: def2-TZVPP
keywords: def2/J RIJCOSX
keywords: DEFGRID2
keywords: scfconv7
keywords: smallprint printgap noloewdin
keywords: NOSOSCF
formula: C20H16Cl2N2O3
InChI: InChI=1/C20H16Cl2N2O3/c1-12-18(19(26)15-9-8-14(21)10-16(15)22)20(24(2)23-12)27-11-17(25)13-6-4-3-5-7-13/h3-10H,11H2,1-2H3
43 atoms
Cl 2.410021 -2.302642 -2.058504
Cl 6.433929 0.428334 0.200456
O  -2.547442 -1.172436 -0.814411
O  0.056614 0.418442 -1.578851
O  -3.510943 0.117804 1.339764
N  -1.784067 -2.560489 0.823873
N  -0.683751 -2.915137 1.50925
C  -0.192219 -1.236629 0.08297
C  -1.552045 -1.565339 -0.026526
C  0.278863 -2.13689 1.089874
C  0.545194 -0.294573 -0.722878
C  2.021136 -0.159605 -0.470902
C  1.63468 -2.300235 1.686293
C  -3.041208 -3.220083 1.072007
C  -2.844222 0.19938 -0.938867
C  -3.388306 0.792109 0.34704
C  2.950787 -0.995883 -1.068338
C  2.484711 0.879828 0.324318
C  -3.759319 2.232217 0.327527
C  4.311745 -0.825386 -0.871799
C  3.83795 1.068997 0.543794
C  4.742637 0.209339 -0.059171
C  -4.303105 2.794524 1.481733
C  -3.582137 3.032893 -0.799908
C  -4.661067 4.129949 1.507027
C  -3.941621 4.37061 -0.773092
C  -4.48055 4.92033 0.379519
H  1.568512 -2.998715 2.518221
H  2.348506 -2.703665 0.968668
H  2.040263 -1.360509 2.058125
H  -3.373522 -3.775913 0.196409
H  -2.883039 -3.91162 1.8927
H  -3.801861 -2.494054 1.347951
H  -1.970904 0.757695 -1.284288
H  -3.607347 0.265274 -1.718687
H  1.772692 1.549465 0.789599
H  5.021252 -1.488413 -1.345878
H  4.185698 1.877303 1.171185
H  -4.439955 2.175577 2.358024
H  -3.155496 2.629859 -1.708938
H  -5.080852 4.558425 2.407089
H  -3.798101 4.983593 -1.652493
H  -4.759153 5.965645 0.400726
totalener: -2027.42756581 hartree
nucrepener: 2674.80033193 hartree
electener: -4702.22789774 hartree
oneelecener: -8096.70934056 hartree
twoeener: 3394.48144282 hartree
kineticenergy: 2021.55650632 hartree
xcener: -148.644133737041 hartree
chargesum: 0.0000000
charge: -0.051951 -0.065445 -0.308570 -0.380561 -0.354646 0.128892 -0.289685 -0.237625 0.248699 0.109218 0.354120 0.104691 -0.285007 -0.176424 -0.048760 0.356323 -0.012383 -0.159690 -0.051283 -0.156563 -0.140278 0.100644 -0.121758 -0.146004 -0.126361 -0.142771 -0.092771 0.111605 0.103274 0.100295 0.109675 0.113095 0.118206 0.143754 0.129963 0.122292 0.116039 0.124386 0.138633 0.120429 0.130786 0.130645 0.132872
qa: -0.0520 -0.0654 -0.3086 -0.3806 -0.3546 0.1289 -0.2897 -0.2376 0.2487 0.1092 0.3541 0.1047 -0.2850 -0.1764 -0.0488 0.3563 -0.0124 -0.1597 -0.0513 -0.1566 -0.1403 0.1006 -0.1218 -0.1460 -0.1264 -0.1428 -0.0928 0.1116 0.1033 0.1003 0.1097 0.1131 0.1182 0.1438 0.1300 0.1223 0.1160 0.1244 0.1386 0.1204 0.1308 0.1306 0.1329
va: 1.2655 1.2385 2.1313 2.1015 2.1153 3.3285 2.9245 3.5147 4.1233 3.9130 3.8970 3.5555 3.9882 3.8915 3.8641 3.7806 4.0236 3.9945 3.6967 4.0847 4.0081 3.9328 4.0065 3.9803 3.9553 4.0038 3.9510 1.0207 0.9933 0.9877 0.9885 1.0127 1.0040 1.0148 0.9994 1.0112 1.0242 1.0119 1.0262 1.0130 1.0018 1.0024 0.9976
dispcorr: -0.023556653 hartree
energy: -2027.451122467363
dipole: -30.90288 29.82473 -1.07815 8.26747 -7.15555 1.11192 10.49994 -10.36375 0.13620
magnitude: 1.55477 au
magnitude: 3.95192 debye
