program: Orca
programVersion: 5.0.2
elementType: Cl Cl O O O N N C C C C C C C C C C C C C C C C C C C C H H H H H H H H H H H H H H H H
charge: 0
multiplicity: 1
keywords: wb97x-d3
keywords: def2-TZVPP
keywords: def2/J RIJCOSX
keywords: DEFGRID2
keywords: scfconv7
keywords: smallprint printgap noloewdin
keywords: NOSOSCF
formula: C20H16Cl2N2O3
InChI: InChI=1/C20H16Cl2N2O3/c1-12-18(19(26)15-9-8-14(21)10-16(15)22)20(24(2)23-12)27-11-17(25)13-6-4-3-5-7-13/h3-10H,11H2,1-2H3
43 atoms
Cl 2.334839 -2.333842 -2.013698
Cl 6.502551 0.295391 0.099832
O  -2.515364 -1.125724 -0.8029
O  0.081238 0.524497 -1.492474
O  -3.528606 0.1486 1.340421
N  -1.765129 -2.508261 0.846064
N  -0.670107 -2.861896 1.539413
C  -0.169136 -1.18371 0.116562
C  -1.528203 -1.511614 -0.00158
C  0.295678 -2.084042 1.12609
C  0.57215 -0.233192 -0.676949
C  2.057183 -0.146135 -0.462812
C  1.645586 -2.242821 1.737106
C  -3.020718 -3.177135 1.077462
C  -2.831946 0.241711 -0.928564
C  -3.401831 0.824958 0.349569
C  2.942682 -1.029812 -1.059543
C  2.576443 0.897125 0.292258
C  -3.80026 2.25791 0.322501
C  4.313089 -0.905121 -0.896061
C  3.939943 1.040674 0.479271
C  4.799273 0.132508 -0.119042
C  -4.412372 2.800111 1.452194
C  -3.586939 3.069851 -0.790622
C  -4.806963 4.125409 1.465571
C  -3.981384 4.397908 -0.775166
C  -4.592379 4.926441 0.3515
H  2.052781 -1.298408 2.094949
H  1.568605 -2.925162 2.581558
H  2.364065 -2.664001 1.034317
H  -3.788392 -2.458343 1.352347
H  -3.341265 -3.727889 0.194358
H  -2.86551 -3.874479 1.893954
H  -1.963413 0.812522 -1.263226
H  -3.587809 0.296293 -1.715872
H  1.899625 1.605981 0.751874
H  4.987421 -1.604641 -1.369096
H  4.331024 1.851571 1.077151
H  -4.576049 2.17254 2.317806
H  -3.104405 2.683731 -1.679019
H  -5.282384 4.53736 2.345761
H  -3.809262 5.020101 -1.642994
H  -4.900786 5.963601 0.362718
totalener: -2027.42749873 hartree
nucrepener: 2672.83732393 hartree
electener: -4700.26482266 hartree
oneelecener: -8092.81109873 hartree
twoeener: 3392.54627607 hartree
kineticenergy: 2021.55384272 hartree
xcener: -148.643800400111 hartree
chargesum: 0.0000000
charge: -0.051532 -0.065167 -0.309507 -0.382548 -0.355164 0.129777 -0.289531 -0.243476 0.250405 0.108553 0.359357 0.108037 -0.283361 -0.177082 -0.049128 0.356533 -0.021146 -0.156968 -0.050932 -0.153716 -0.141934 0.101544 -0.120889 -0.147314 -0.127225 -0.142638 -0.092612 0.099815 0.111641 0.103210 0.118556 0.109542 0.113076 0.143493 0.131303 0.122384 0.116275 0.124546 0.138508 0.121266 0.130859 0.130672 0.132518
qa: -0.0515 -0.0652 -0.3095 -0.3825 -0.3552 0.1298 -0.2895 -0.2435 0.2504 0.1086 0.3594 0.1080 -0.2834 -0.1771 -0.0491 0.3565 -0.0211 -0.1570 -0.0509 -0.1537 -0.1419 0.1015 -0.1209 -0.1473 -0.1272 -0.1426 -0.0926 0.0998 0.1116 0.1032 0.1186 0.1095 0.1131 0.1435 0.1313 0.1224 0.1163 0.1245 0.1385 0.1213 0.1309 0.1307 0.1325
va: 1.2659 1.2389 2.1306 2.1017 2.1146 3.3269 2.9237 3.5122 4.1260 3.9127 3.8874 3.5512 3.9873 3.8915 3.8617 3.7844 4.0235 3.9961 3.6970 4.0800 4.0083 3.9325 4.0055 3.9813 3.9557 4.0027 3.9505 0.9884 1.0206 0.9929 1.0039 0.9886 1.0127 1.0174 0.9990 1.0118 1.0240 1.0118 1.0261 1.0129 1.0017 1.0023 0.9977
dispcorr: -0.023549932 hartree
energy: -2027.451048660472
dipole: -30.97498 29.91231 -1.06267 8.74893 -7.65913 1.08979 10.52912 -10.43693 0.09219
magnitude: 1.52493 au
magnitude: 3.87607 debye
