program: Orca
programVersion: 5.0.2
elementType: Cl Cl O O O N N C C C C C C C C C C C C C C C C C C C C H H H H H H H H H H H H H H H H
charge: 0
multiplicity: 1
keywords: wb97x-d3
keywords: def2-TZVPP
keywords: def2/J RIJCOSX
keywords: DEFGRID2
keywords: scfconv7
keywords: smallprint printgap noloewdin
keywords: NOSOSCF
formula: C20H16Cl2N2O3
InChI: InChI=1/C20H16Cl2N2O3/c1-12-18(19(26)15-9-8-14(21)10-16(15)22)20(24(2)23-12)27-11-17(25)13-6-4-3-5-7-13/h3-10H,11H2,1-2H3
43 atoms
Cl 0.786271 0.449323 1.398884
Cl 5.858817 1.268384 -0.085447
O  -2.696463 -1.75901 -1.028292
O  -0.156915 -0.287758 -2.365606
O  -2.591326 -0.216094 1.149764
N  -1.626717 -3.28933 0.260734
N  -0.416913 -3.685702 0.6948
C  -0.208889 -1.855612 -0.609438
C  -1.556226 -2.21614 -0.523201
C  0.443094 -2.832913 0.204134
C  0.377814 -0.796469 -1.397496
C  1.744512 -0.307612 -1.020003
C  1.892606 -3.016954 0.495752
C  -2.824099 -3.93942 0.726069
C  -2.885379 -0.375321 -1.19548
C  -2.724268 0.383071 0.112194
C  2.021924 0.285979 0.205199
C  2.761056 -0.363614 -1.966804
C  -2.740383 1.866567 0.052194
C  3.282952 0.78077 0.498807
C  4.033098 0.103516 -1.691388
C  4.282612 0.672911 -0.452414
C  -2.52095 2.582602 1.228252
C  -2.964818 2.561914 -1.134342
C  -2.526172 3.965173 1.215719
C  -2.976903 3.947146 -1.144447
C  -2.756091 4.650033 0.029696
H  2.272212 -2.250526 1.171458
H  2.037721 -3.983362 0.974652
H  2.502532 -2.986357 -0.406438
H  -2.517135 -4.742007 1.388619
H  -3.449824 -3.237196 1.275163
H  -3.396546 -4.357435 -0.100298
H  -2.221551 0.01892 -1.96615
H  -3.914223 -0.259224 -1.546684
H  2.549572 -0.792659 -2.937386
H  3.477983 1.248307 1.453309
H  4.817796 0.036603 -2.431387
H  -2.342996 2.045241 2.149707
H  -3.127416 2.036538 -2.066211
H  -2.348745 4.51301 2.131435
H  -3.152171 4.476667 -2.071116
H  -2.759784 5.732015 0.020498
totalener: -2027.42585885 hartree
nucrepener: 2793.70066007 hartree
electener: -4821.12651892 hartree
oneelecener: -8334.83964901 hartree
twoeener: 3513.71313009 hartree
kineticenergy: 2021.57330674 hartree
xcener: -148.648910160470 hartree
chargesum: -0.0000000
charge: -0.050388 -0.064104 -0.310910 -0.374526 -0.333449 0.113407 -0.290133 -0.217112 0.266580 0.110105 0.314245 0.111492 -0.273110 -0.172945 -0.036910 0.305409 -0.064021 -0.132771 -0.017726 -0.129670 -0.143283 0.092735 -0.131954 -0.142252 -0.121624 -0.137656 -0.096216 0.101962 0.110021 0.095742 0.113317 0.114967 0.107000 0.142446 0.132584 0.123363 0.117185 0.124891 0.136098 0.116147 0.130319 0.129007 0.131740
qa: -0.0504 -0.0641 -0.3109 -0.3745 -0.3334 0.1134 -0.2901 -0.2171 0.2666 0.1101 0.3142 0.1115 -0.2731 -0.1729 -0.0369 0.3054 -0.0640 -0.1328 -0.0177 -0.1297 -0.1433 0.0927 -0.1320 -0.1423 -0.1216 -0.1377 -0.0962 0.1020 0.1100 0.0957 0.1133 0.1150 0.1070 0.1424 0.1326 0.1234 0.1172 0.1249 0.1361 0.1161 0.1303 0.1290 0.1317
va: 1.2685 1.2409 2.1372 2.0957 2.1228 3.3186 2.9309 3.3876 4.1042 3.9287 3.9149 3.4016 3.9729 3.8992 3.8386 3.8013 4.0065 3.9841 3.6534 4.0521 4.0038 3.9425 4.0031 3.9888 3.9625 4.0008 3.9571 0.9940 1.0207 0.9923 1.0131 0.9985 0.9894 1.0172 0.9931 1.0172 1.0228 1.0114 1.0275 1.0151 1.0015 1.0025 0.9978
dispcorr: -0.025907424 hartree
energy: -2027.451766276141
dipole: -21.03441 20.31218 -0.72223 -4.65323 5.40196 0.74873 -2.86722 2.48028 -0.38694
magnitude: 1.10993 au
magnitude: 2.82123 debye
