program: Orca
programVersion: 5.0.2
elementType: Cl Cl O O O N N C C C C C C C C C C C C C C C C C C C C H H H H H H H H H H H H H H H H
charge: 0
multiplicity: 1
keywords: wb97x-d3
keywords: def2-TZVPP
keywords: def2/J RIJCOSX
keywords: DEFGRID2
keywords: scfconv7
keywords: smallprint printgap noloewdin
keywords: NOSOSCF
formula: C20H16Cl2N2O3
InChI: InChI=1/C20H16Cl2N2O3/c1-12-18(19(26)15-9-8-14(21)10-16(15)22)20(24(2)23-12)27-11-17(25)13-6-4-3-5-7-13/h3-10H,11H2,1-2H3
43 atoms
Cl 0.925445 0.366517 -1.350793
Cl 6.038993 1.029862 0.077772
O  -2.627661 -1.567867 1.21775
O  -0.058354 -0.088765 2.441938
O  -2.581559 -0.292627 -1.137195
N  -1.610621 -3.225286 0.043284
N  -0.414534 -3.688359 -0.361012
C  -0.149526 -1.769278 0.796587
C  -1.50617 -2.096341 0.740026
C  0.471478 -2.824769 0.060495
C  0.46678 -0.677331 1.515114
C  1.85207 -0.265599 1.115483
C  1.913281 -3.070185 -0.222993
C  -2.828002 -3.882372 -0.355982
C  -2.799746 -0.172464 1.222347
C  -2.726025 0.419694 -0.175501
C  2.155744 0.226992 -0.14765
C  2.86536 -0.301728 2.066528
C  -2.842822 1.895972 -0.297274
C  3.438685 0.637624 -0.473811
C  4.158143 0.08184 1.760422
C  4.43411 0.54679 0.483995
C  -2.713274 2.472815 -1.56017
C  -3.081925 2.71593 0.804025
C  -2.820282 3.842487 -1.716481
C  -3.194925 4.08741 0.64536
C  -3.063323 4.651677 -0.614189
H  2.030372 -4.076232 -0.621154
H  2.305059 -2.371901 -0.962582
H  2.531824 -2.980078 0.66919
H  -3.397774 -4.221982 0.507491
H  -3.445529 -3.210877 -0.950471
H  -2.547918 -4.74125 -0.957002
H  -3.80028 -0.003327 1.628545
H  -2.085265 0.312537 1.890729
H  2.635137 -0.651131 3.064403
H  3.654272 1.025525 -1.459106
H  4.940043 0.02858 2.50446
H  -2.525993 1.837678 -2.415256
H  -3.178704 2.300456 1.798478
H  -2.713826 4.282877 -2.69872
H  -3.380975 4.71524 1.506118
H  -3.147189 5.723373 -0.737469
totalener: -2027.42660235 hartree
nucrepener: 2774.57975103 hartree
electener: -4802.00635338 hartree
oneelecener: -8296.55165255 hartree
twoeener: 3494.54529917 hartree
kineticenergy: 2021.56529889 hartree
xcener: -148.647117879337 hartree
chargesum: -0.0000000
charge: -0.049825 -0.063791 -0.311833 -0.374429 -0.337127 0.116566 -0.290593 -0.226213 0.265673 0.111070 0.321770 0.104572 -0.274781 -0.173391 -0.036796 0.318636 -0.058585 -0.130863 -0.023720 -0.131766 -0.144133 0.094028 -0.128478 -0.146984 -0.122589 -0.140051 -0.094488 0.110105 0.102043 0.096211 0.107495 0.114223 0.113423 0.130705 0.144003 0.123365 0.117125 0.124900 0.135918 0.117379 0.130541 0.129179 0.131506
qa: -0.0498 -0.0638 -0.3118 -0.3744 -0.3371 0.1166 -0.2906 -0.2262 0.2657 0.1111 0.3218 0.1046 -0.2748 -0.1734 -0.0368 0.3186 -0.0586 -0.1309 -0.0237 -0.1318 -0.1441 0.0940 -0.1285 -0.1470 -0.1226 -0.1401 -0.0945 0.1101 0.1020 0.0962 0.1075 0.1142 0.1134 0.1307 0.1440 0.1234 0.1171 0.1249 0.1359 0.1174 0.1305 0.1292 0.1315
va: 1.2699 1.2411 2.1355 2.0966 2.1200 3.3203 2.9304 3.3958 4.1054 3.9307 3.9175 3.4031 3.9744 3.8991 3.8455 3.7902 4.0037 3.9832 3.6774 4.0512 4.0049 3.9395 4.0066 3.9860 3.9564 4.0053 3.9551 1.0208 0.9938 0.9919 0.9891 0.9993 1.0130 0.9948 1.0100 1.0170 1.0228 1.0114 1.0277 1.0141 1.0017 1.0027 0.9979
dispcorr: -0.025420765 hartree
energy: -2027.452023115504
dipole: -22.35925 21.57895 -0.78030 -3.77657 4.59430 0.81773 2.45608 -2.20037 0.25571
magnitude: 1.15886 au
magnitude: 2.94558 debye
