program: Gaussian 09
title: 000059469
version: EM64L-G09RevD.01
frameworkgroup: C1[X(C11H18N2O)]
method: RPBEPBE
basis: SDD
operation: Freq
keyword: #p
keyword: freq=noraman
keyword: PBEPBE/SDD
title: #p freq=noraman PBEPBE/SDD
converged: YES YES NO NO
title: Mulliken charges:
elementType: O N N C C C C C C C C C C C H H H H H H H H H H H H H H H H H H
charge: -0.277287 -0.317013 -0.302984 -0.011125 -0.595700 0.368364 -0.689356 0.168667 -0.372066 -0.366878 -0.260961 -0.238788 -0.593609 -0.539746 0.195003 0.266400 0.183636 0.240256 0.218924 0.208340 0.233990 0.230354 0.236200 0.246845 0.223392 0.222636 0.245392 0.207512 0.185954 0.219665 0.220262 0.243720
chargesum: 0.00000
title: Mulliken charges with hydrogens summed into heavy atoms:
elementType: O N N C C C C C C C C C C C
charge: -0.277287 -0.083023 -0.056139 0.183877 -0.145664 0.368364 -0.021837 0.168667 -0.141711 -0.130678 -0.037568 -0.016152 0.045249 0.143902
polarizability: 1.76075290e+02 -3.52000036e+00 1.47456873e+02 1.20679994e+01 -1.22321466e+00 9.35942581e+01
1716.lowfreq: -16.1641 -4.7438 0.0004 0.0004 0.0006 2.7960 32.0311 32.7524 59.7785
frequency: 31.4519 32.6804 59.7735 86.3751 93.3806 100.5765 159.9805 178.8723 204.5366 222.1335 241.3900 244.2434 286.2806 300.1155 334.8851 376.8345 426.7483 460.7591 477.7627 496.3127 527.9107 564.9976 593.7062 655.9101 717.9962 733.1237 753.0693 754.3289 824.8737 838.5151 855.9816 895.9017 929.4526 937.5229 969.5949 979.8304 989.5822 1037.1326 1058.7816 1099.1323 1107.2618 1111.2839 1126.5225 1143.9542 1151.7301 1161.1241 1171.3039 1176.3722 1195.6306 1223.4512 1230.0196 1282.9925 1289.1120 1326.2954 1337.4404 1375.3012 1389.1257 1414.7667 1428.7860 1433.7091 1443.9091 1459.6607 1461.1967 1462.9984 1467.3502 1470.8914 1477.8995 1484.9466 1490.3001 1501.1565 1595.5537 1605.6436 2856.4122 2888.2280 2955.7988 2957.2441 2989.6119 3024.6874 3043.9356 3074.0473 3090.1293 3093.8059 3098.8961 3114.4951 3121.3461 3130.6154 3152.2729 3166.3768 3274.3860 3322.7813
redmass: 2.7544 3.6221 3.5978 3.0870 3.2028 2.5978 2.2672 2.4938 2.0286 1.1774 1.4785 1.5436 2.8869 3.2177 2.5962 2.4910 2.7455 2.4255 3.6418 3.5210 4.0391 3.7600 4.6861 1.6417 2.5435 1.9961 2.9421 1.4447 3.4109 1.8398 1.9882 1.4279 1.4383 1.9201 1.3102 1.9579 8.6451 1.9398 1.7949 2.1200 1.4432 1.2605 1.6658 2.1040 1.5107 1.7301 1.1389 4.0341 1.9775 1.5866 2.7586 1.2681 1.4715 1.3926 1.3456 1.2265 6.6066 1.1431 1.4645 1.1990 1.6021 1.0654 1.0774 1.0936 1.0515 1.1770 1.1134 1.1593 1.8153 1.1060 6.9381 6.4510 1.0817 1.0543 1.0644 1.0361 1.0346 1.0775 1.1038 1.0923 1.0995 1.0991 1.1004 1.0877 1.0992 1.0880 1.0933 1.0989 1.0736 1.0749
irintensity: 1.9710 1.1858 0.8123 0.5925 5.3252 5.0221 0.8531 3.1924 1.8212 0.2885 1.5056 3.5572 3.0314 1.4102 1.2700 34.2176 2.7200 3.0670 5.8886 9.7968 6.0867 9.1391 2.0030 17.2081 40.6867 71.7902 38.6004 92.0609 1.6966 2.1960 1.7765 1.7418 2.6490 3.3613 0.0259 3.8416 39.5824 7.9165 5.4700 29.9260 3.3926 0.1845 60.1129 0.3727 3.6724 3.8645 7.2375 0.5746 23.2927 28.4012 89.3858 0.9008 0.3298 16.9538 28.8352 24.2549 10.8951 5.1483 20.5995 0.8853 7.6199 0.5856 13.0346 7.6076 12.3717 70.9197 18.8133 10.0381 23.8962 4.7328 10.2400 19.7112 77.0413 165.7261 72.7698 46.9926 18.8641 53.2696 48.8278 5.2198 34.5425 25.7331 24.2907 12.0596 23.2555 9.0174 29.7403 20.3731 38.5033 32.6565
temp: 298.150 k
press: 1.00000 atm
elementType: 8 7 7 6 6 6 6 6 6 6 6 6 6 6 1 1 1 1 1 1 1 1 1 1 1 1 1 1 1 1 1 1
symmnumber: 1
zpe: 717072.7 jmol-1
zpe.correction: 0.273119 hartree
zpe.thermalcorrener: 0.288611 hartree
zpe.thermalcorrenthalpy: 0.289555 hartree
zpe.thermalcorrgfe: 0.229382 hartree
zpe.sumelectzpe: -613.541773 hartree
zpe.sumelectthermal: -613.526281 hartree
zpe.sumelectthermalent: -613.525337 hartree
zpe.sumelectthermalfe: -613.585510 hartree
dipole: 0.6360 -0.3144 -0.4812
dipole: 0.8572
quadrupole: -72.4153 -74.9189 -88.9879
quadrupole: 10.7842 5.6407 1.9003
quadrupole: 6.3588 3.8551 -10.2139 10.7842 5.6407 1.9003
hfenergy: -613.8148919 hartree
pointgroup: C01 [X(C11H18N2O1)]
dipole: -0.2570316 0.1428763 -0.1651331 debye
polarizability: 176.0372412|-0.1662091|145.5071938|-13.2175117|9.4376525|95.5819863 unknown
InChI: InChI=1S/C11H18N2O/c1-9(13-12-2)8-10-6-4-5-7-11(10)14-3/h4-7,9,12-13H,8H2,1-3H3
charge 0 multiplicity 1
32 atoms
O  -1.269315 -1.780825 -0.644963
N  2.970994 0.324015 -0.480142
N  4.087655 0.541639 0.393037
C  1.651798 0.377811 0.210082
C  0.559469 0.364398 -0.899728
C  -0.844545 0.562419 -0.354244
C  1.520686 -0.797234 1.192469
C  -1.753954 -0.528811 -0.219975
C  -1.290032 1.841575 0.052609
C  -3.054947 -0.335381 0.307254
C  -2.584395 2.051525 0.582995
C  -3.464683 0.956344 0.709513
C  5.295196 -0.199336 -0.007518
C  -2.163618 -2.932627 -0.530534
H  1.542449 1.331757 0.786352
H  0.633047 -0.591813 -1.444072
H  0.782994 1.181836 -1.61884
H  2.383155 -0.793716 1.880601
H  1.50581 -1.75282 0.639779
H  0.588488 -0.712681 1.779017
H  2.981118 0.929789 -1.32386
H  -0.604347 2.691533 -0.056386
H  -3.750395 -1.174329 0.406737
H  4.274472 1.539403 0.596448
H  -2.899993 3.054749 0.888349
H  -4.47201 1.099802 1.11656
H  5.058049 -1.275298 -0.036136
H  6.081589 -0.029998 0.751974
H  5.704316 0.087191 -1.006256
H  -3.076564 -2.798784 -1.143573
H  -2.449929 -3.119009 0.523091
H  -1.582961 -3.785521 -0.912239
