program: Gaussian 09
title: 000059504
version: EM64L-G09RevD.01
frameworkgroup: C1[X(C22H32NO)]
method: RPBEPBE
basis: SDD
operation: Freq
keyword: #p
keyword: freq=noraman
keyword: PBEPBE/SDD
title: #p freq=noraman PBEPBE/SDD
converged: YES YES NO NO
title: Mulliken charges:
elementType: O N C C C C C C C C C C C C C C C C C C C C C C H H H H H H H H H H H H H H H H H H H H H H H H H H H H H H H H
charge: -0.294688 -0.142501 0.017229 0.032469 -0.378976 -0.581838 -0.730065 -0.735317 -0.724117 -0.721385 -0.259524 -0.264236 0.361285 0.425153 -0.383812 -0.442673 -0.393378 -0.361341 -0.231263 -0.223605 -0.220983 -0.236679 -0.236528 -0.237613 0.275498 0.242806 0.279009 0.282765 0.265186 0.257594 0.269434 0.257023 0.224245 0.275564 0.261730 0.244514 0.240035 0.264325 0.241055 0.233009 0.257546 0.249445 0.247114 0.222142 0.202099 0.218739 0.254097 0.243138 0.246018 0.267833 0.238164 0.242172 0.233298 0.242015 0.241385 0.245391
chargesum: 1.00000
title: Mulliken charges with hydrogens summed into heavy atoms:
elementType: O N C C C C C C C C C C C C C C C C C C C C C C
charge: -0.294688 -0.142501 0.292727 0.275274 0.182797 0.210376 0.026767 0.010962 0.014272 0.032721 0.164717 -0.045498 0.361285 0.425153 -0.129715 -0.199535 -0.147360 -0.093508 0.006900 0.018567 0.012315 0.005337 0.004857 0.007778
polarizability: 2.54733234e+02 -9.66850274e+00 2.65210043e+02 -1.32609543e+01 5.76386706e+00 1.96776002e+02
1716.lowfreq: -30.8932 -12.1664 -4.2418 -0.0006 -0.0005 0.0004 4.8370 17.7871 22.7890
frequency: -26.6150 16.9088 20.7466 39.9836 45.1274 56.7610 71.3490 100.6213 104.1841 117.2611 160.3517 175.9265 189.9707 201.4548 205.5923 217.5346 227.0837 233.7342 249.4191 261.2478 274.3118 287.3073 312.1120 328.9095 344.5815 359.6742 375.6972 386.8262 400.7122 404.1403 419.1528 431.5727 448.2146 459.7117 474.5384 499.1870 545.0532 583.5710 606.5224 614.4136 616.1663 645.6716 661.3665 701.3686 704.8849 710.0741 741.9305 771.9735 824.9858 836.1596 857.9637 861.1250 865.5328 874.6484 891.7925 894.7671 915.4277 932.1818 935.0577 939.7643 941.6264 944.9645 956.9923 960.1519 983.3346 985.6350 989.6089 990.6533 1004.7275 1006.8125 1015.2956 1025.1420 1029.8217 1072.4580 1080.5426 1082.6290 1086.5547 1111.9245 1114.5360 1131.8750 1146.2404 1158.3824 1176.4056 1177.0958 1178.3412 1183.7920 1185.7425 1188.4779 1193.0498 1194.7128 1214.3157 1226.8046 1270.5647 1277.0452 1291.9872 1320.1159 1326.5170 1332.4312 1339.1781 1340.4226 1347.6872 1356.2686 1381.2485 1385.1784 1393.6598 1401.1335 1405.3715 1417.2158 1419.5975 1436.7416 1440.1273 1442.8319 1450.8128 1460.3072 1470.7119 1472.6760 1480.6314 1481.0415 1483.7373 1485.9785 1487.9302 1490.6084 1496.4214 1497.9424 1501.6742 1505.2933 1591.2685 1593.0838 1609.1055 1613.3894 2922.1402 2942.9956 2997.0143 3003.3207 3005.7130 3006.0081 3012.2575 3038.4900 3045.9441 3059.3499 3069.9483 3090.5891 3093.7592 3099.5074 3100.3913 3105.4008 3109.2553 3111.7919 3117.0593 3120.5260 3123.6849 3129.2185 3131.8006 3138.0165 3141.9866 3150.8220 3152.7479 3155.9598 3161.8866 3162.2022 3169.4329 3172.8007
redmass: 3.6022 3.7849 4.0025 3.9549 4.0299 3.7772 4.5553 2.8813 2.7785 2.0922 2.7389 2.1090 1.7462 1.4361 4.0837 2.0853 2.5280 1.4088 2.0928 1.1267 1.4021 4.2340 3.0811 2.3146 2.5937 2.8381 2.5136 2.8788 2.8238 2.8444 3.4449 2.5856 2.5189 3.2233 2.9818 2.8965 3.8133 2.7125 5.1910 6.3257 6.3414 4.3228 3.0084 2.3731 2.3201 1.7565 1.7186 1.9679 2.7542 1.4954 1.2572 1.6921 2.0298 3.2925 2.5138 2.5057 2.5762 1.2782 1.5483 1.7456 1.6243 1.2758 1.4264 2.0848 1.4011 1.3938 5.3750 6.1431 1.3186 1.3577 6.6563 2.2782 2.1558 1.5563 1.8218 1.6189 1.5859 1.7540 2.2263 2.0191 1.7268 1.6117 1.0905 1.0802 1.8601 2.2150 2.0058 1.1238 1.2436 2.0498 1.5940 1.3028 1.5014 1.5819 1.1391 1.3273 1.3731 1.3317 1.3398 1.3094 1.2091 1.2365 9.0739 5.5601 1.3352 1.2031 1.1932 1.1876 1.1855 2.1976 1.1669 2.0926 1.0657 1.0495 1.0482 1.0502 1.9504 1.1258 2.2932 1.0544 1.0499 1.0549 1.0606 1.0483 1.0538 1.0622 5.9282 6.2337 5.9739 6.0710 1.0828 1.0569 1.1028 1.0372 1.0373 1.0379 1.0378 1.0843 1.0343 1.0593 1.0869 1.0981 1.0981 1.0974 1.0971 1.1008 1.1008 1.0999 1.0888 1.1010 1.1044 1.0868 1.0852 1.0882 1.0907 1.0931 1.0958 1.1029 1.0955 1.1040 1.1013 1.1009
irintensity: 0.1540 0.1555 0.6138 0.1071 0.3895 1.5669 1.2652 0.6047 0.8466 0.0701 0.7106 4.5550 0.3176 1.6771 7.1049 0.3323 0.1099 0.6415 0.6478 0.0915 1.1806 0.4444 1.0815 0.2871 0.8676 0.6262 0.4738 0.6457 0.1421 0.6966 1.7911 2.4229 2.1909 2.9768 1.6534 3.1474 3.2728 3.0398 17.1039 2.6502 1.2723 8.4422 12.6190 55.9490 2.5245 56.5822 70.4956 76.1878 4.3712 2.7367 0.5235 4.8046 4.3868 11.0428 1.1275 4.1182 84.9338 3.4239 2.2063 5.0283 12.5074 6.3920 1.6754 8.7426 0.4271 0.0535 2.0280 3.3185 0.1595 1.3057 132.2327 7.9598 9.9319 7.9653 8.4360 15.8072 2.4660 14.5962 8.6442 30.7162 10.5943 8.4778 1.0690 0.2506 6.4726 9.2000 3.7977 2.3068 4.7268 10.1119 5.2983 1.7353 9.2670 51.2671 10.0475 1.9338 1.3547 2.8328 1.8234 1.0539 2.2407 5.1258 0.2917 1.0629 5.9820 9.4651 13.6557 27.1642 58.4885 16.4756 9.8089 11.9286 18.1385 5.9836 13.4478 10.3212 0.2548 27.0346 20.7954 16.3507 15.0704 26.2369 8.2885 1.2787 26.7882 6.0035 0.5409 0.3186 0.3367 1.9823 25.2647 73.9751 34.8146 5.7442 6.7600 3.9466 3.6917 6.7353 5.4534 5.0911 0.8263 2.2364 5.6658 6.8436 21.6589 12.3312 8.3611 33.2719 7.1023 16.6980 7.0784 1.9448 2.1100 0.9825 4.3210 18.1253 19.6566 4.6506 26.7387 5.0921 15.9171 12.6845
temp: 298.150 k
press: 1.00000 atm
elementType: 8 7 6 6 6 6 6 6 6 6 6 6 6 6 6 6 6 6 6 6 6 6 6 6 1 1 1 1 1 1 1 1 1 1 1 1 1 1 1 1 1 1 1 1 1 1 1 1 1 1 1 1 1 1 1 1
symmnumber: 1
zpe: 1289053.5 jmol-1
zpe.correction: 0.490975 hartree
zpe.thermalcorrener: 0.515199 hartree
zpe.thermalcorrenthalpy: 0.516143 hartree
zpe.thermalcorrgfe: 0.436619 hartree
zpe.sumelectzpe: -985.427174 hartree
zpe.sumelectthermal: -985.402949 hartree
zpe.sumelectthermalent: -985.402005 hartree
zpe.sumelectthermalfe: -985.481530 hartree
dipole: -13.0754 -0.9762 -0.2725
dipole: 13.1146
quadrupole: -74.8804 -117.9588 -128.8527
quadrupole: 9.9329 1.1492 -0.1299
quadrupole: 32.3503 -10.7282 -21.6221 9.9329 1.1492 -0.1299
hfenergy: -985.9181486 hartree
pointgroup: C01 [X(C22H32N1O1)]
dipole: -5.1279174 0.5105489 -0.2575174 debye
polarizability: 252.744724|8.3003357|263.7555115|18.2661245|10.2875625|200.2190429 unknown
InChI: InChI=1S/C22H32NO/c1-18(2)23(5,19(3)4)16-17-24-22(20-12-8-6-9-13-20)21-14-10-7-11-15-21/h6-15,18-19,22H,16-17H2,1-5H3
charge 1 multiplicity 1
56 atoms
O  0.375071 0.916501 0.079761
N  -3.390246 0.879686 0.200658
C  -3.545096 -0.665543 0.531608
C  -4.032521 1.220433 -1.221039
C  -1.91202 1.316814 0.301638
C  -4.139432 1.702513 1.251837
C  -2.77367 -1.083846 1.79862
C  -5.026673 -1.080743 0.624135
C  -3.655769 2.639023 -1.692463
C  -3.726303 0.176952 -2.312832
C  -0.884472 0.579208 -0.572929
C  1.5711 0.260135 -0.560298
C  2.80283 0.898695 0.081211
C  1.4661 -1.25373 -0.427913
C  4.01246 0.16951 0.199125
C  1.376647 -2.073798 -1.578791
C  2.773988 2.257846 0.484082
C  1.425926 -1.857418 0.856952
C  5.172945 0.788523 0.71557
C  1.25879 -3.478414 -1.454721
C  3.932178 2.872404 1.008017
C  1.300318 -3.257239 0.983525
C  5.136877 2.140939 1.123504
C  1.21775 -4.072092 -0.172774
H  -3.081933 -1.164951 -0.333904
H  -5.116984 1.198626 -1.010459
H  -1.881849 2.396615 0.092984
H  -1.612502 1.17588 1.351853
H  -3.788472 1.418123 2.253659
H  -3.933504 2.770059 1.091538
H  -5.219154 1.519488 1.168509
H  -2.967295 -2.159359 1.957738
H  -3.118696 -0.564009 2.709548
H  -1.681583 -0.97151 1.707516
H  -5.066133 -2.183733 0.644622
H  -5.503539 -0.726436 1.553705
H  -5.636408 -0.75668 -0.235377
H  -4.299126 2.886187 -2.554733
H  -2.611098 2.702266 -2.041535
H  -3.831047 3.422714 -0.936947
H  -4.174839 0.544829 -3.252455
H  -2.648094 0.051193 -2.500309
H  -4.173753 -0.810126 -2.115849
H  -1.039552 -0.519216 -0.581247
H  -0.886414 0.942092 -1.623071
H  1.546646 0.526596 -1.64206
H  4.052236 -0.88016 -0.111117
H  1.422243 -1.61776 -2.57628
H  1.841694 2.823534 0.397086
H  1.51423 -1.225338 1.748227
H  6.102196 0.214904 0.799467
H  1.208972 -4.105235 -2.351505
H  3.897366 3.921507 1.321816
H  1.285525 -3.717248 1.977759
H  6.036488 2.619589 1.524973
H  1.136103 -5.159898 -0.073634
