program: Orca
programVersion: 5.0.2
elementType: S F F F O O O O N C C C C C C C C C C C C C C C H H H H H H H H H H H H
charge: 0
multiplicity: 1
keywords: wb97x-d3
keywords: def2-TZVPP
keywords: def2/J RIJCOSX
keywords: DEFGRID2
keywords: scfconv7
keywords: smallprint printgap noloewdin
keywords: NOSOSCF
formula: C15H12F3NO4S
InChI: InChI=1/C15H12F3NO4S/c1-24(21,22)12-6-9(15(16,17)18)4-5-10(12)13(20)11-7-19-23-14(11)8-2-3-8/h4-8H,2-3H2,1H3
36 atoms
S  -0.002443 -2.045472 0.319244
F  -4.978916 1.791494 0.195381
F  -5.1571 0.005325 -0.987518
F  -4.825522 -0.139875 1.130952
O  3.860467 1.160502 1.251854
O  1.532645 0.426687 -2.23996
O  -0.868561 -3.195355 0.07073
O  1.298443 -1.999464 -0.346535
N  2.797254 1.58646 2.01844
C  4.422525 0.220663 -0.873659
C  5.84931 0.717264 -0.859119
C  5.553605 -0.647719 -0.365727
C  3.447006 0.752073 0.060801
C  2.081467 0.893176 0.004085
C  1.183301 0.56743 -1.086251
C  1.749686 1.416634 1.280413
C  -0.280886 0.507686 -0.743102
C  -0.90654 -0.571995 -0.127989
C  -1.051691 1.608713 -1.093289
C  -2.268834 -0.561425 0.131831
C  -3.017167 0.555497 -0.205007
C  -2.408574 1.639166 -0.822944
C  0.236902 -1.890482 2.067796
C  -4.496625 0.556317 0.03913
H  4.008377 -0.038969 -1.836387
H  6.110943 1.480631 -0.138391
H  6.317366 0.829726 -1.827515
H  5.811064 -1.494291 -0.987574
H  5.604323 -0.834371 0.698914
H  0.776627 1.687869 1.663292
H  -0.586826 2.458863 -1.574661
H  -2.739265 -1.419762 0.594045
H  -2.97627 2.515548 -1.104701
H  -0.729529 -1.827917 2.564299
H  0.768436 -2.78092 2.404845
H  0.829668 -1.004115 2.283998
elementType: S F O N C H
totalener: -1632.28762222 hartree
nucrepener: 2333.51955081 hartree
electener: -3965.80717303 hartree
oneelecener: -6880.73487930 hartree
twoeener: 2914.92770627 hartree
cpcmener: -0.05026640 hartree
kineticenergy: 1626.69627309 hartree
xcener: -129.806337081750 hartree
chargesum: 0.0000000
charge: 0.877347 -0.177706 -0.177367 -0.178827 -0.142478 -0.433374 -0.559281 -0.549920 -0.196978 -0.160076 -0.132386 -0.128693 0.275444 -0.187172 0.430380 -0.037254 0.070920 -0.106426 -0.145126 -0.057148 -0.057554 -0.112696 -0.243878 0.550994 0.113112 0.100380 0.104981 0.104373 0.101977 0.179143 0.153218 0.128321 0.157803 0.144147 0.144431 0.147369
qa: 0.8773 -0.1777 -0.1774 -0.1788 -0.1425 -0.4334 -0.5593 -0.5499 -0.1970 -0.1601 -0.1324 -0.1287 0.2754 -0.1872 0.4304 -0.0373 0.0709 -0.1064 -0.1451 -0.0571 -0.0576 -0.1127 -0.2439 0.5510 0.1131 0.1004 0.1050 0.1044 0.1020 0.1791 0.1532 0.1283 0.1578 0.1441 0.1444 0.1474
va: 5.5086 1.1272 1.1144 1.1256 2.2550 2.0384 1.9141 1.9138 2.8327 3.8351 3.9082 3.8917 3.7979 3.6061 3.8116 4.0622 3.6051 3.8369 4.0078 4.0478 3.7616 3.9801 3.8711 4.4280 1.0318 1.0208 1.0158 1.0169 1.0210 0.9938 1.0014 1.0375 1.0032 1.0049 1.0110 1.0015
dispcorr: -0.019987840 hartree
energy: -1632.307610061765
dipole: 35.89931 -35.73610 0.16321 -1.90274 3.61105 1.70832 2.32674 -0.80021 1.52653
magnitude: 2.29680 au
magnitude: 5.83800 debye
