program: Orca
programVersion: 5.0.2
elementType: S F F F O O O O N C C C C C C C C C C C C C C C H H H H H H H H H H H H
charge: 0
multiplicity: 1
keywords: wb97x-d3
keywords: def2-TZVPP
keywords: def2/J RIJCOSX
keywords: DEFGRID2
keywords: scfconv7
keywords: smallprint printgap noloewdin
keywords: NOSOSCF
formula: C15H12F3NO4S
InChI: InChI=1/C15H12F3NO4S/c1-24(21,22)12-6-9(15(16,17)18)4-5-10(12)13(20)11-7-19-23-14(11)8-2-3-8/h4-8H,2-3H2,1H3
36 atoms
S  -0.301106 -2.302098 -0.75225
F  -5.053173 -0.219732 -0.381722
F  -4.95258 0.886553 1.460339
F  -4.693861 1.899408 -0.416179
O  3.947558 1.852525 -0.87235
O  1.695796 -0.800724 1.552823
O  -1.269954 -2.835633 -1.705456
O  1.043121 -1.974472 -1.219673
N  2.874724 2.33331 -1.589486
C  4.558238 0.342974 0.870883
C  5.857362 -0.131822 0.251715
C  5.867315 1.038727 1.158879
C  3.552517 0.972027 0.031803
C  2.183884 0.846272 -0.05264
C  1.307547 -0.011618 0.716259
C  1.837551 1.739434 -1.101486
C  -0.172444 0.16414 0.501293
C  -0.993497 -0.812245 -0.053499
C  -0.758239 1.33631 0.963819
C  -2.364229 -0.632545 -0.153708
C  -2.931729 0.537007 0.323791
C  -2.127202 1.52237 0.88211
C  -0.190487 -3.427856 0.613785
C  -4.411493 0.769206 0.241969
H  4.149102 -0.272542 1.657988
H  5.998341 0.03584 -0.808215
H  6.23487 -1.078572 0.61445
H  6.25364 0.914045 2.161826
H  6.029181 2.020696 0.733556
H  0.860384 1.950925 -1.510937
H  -0.140775 2.112803 1.397381
H  -2.974808 -1.401501 -0.6067
H  -2.55338 2.443984 1.257499
H  -1.188431 -3.624385 1.00154
H  0.248885 -4.35376 0.240397
H  0.440204 -3.005689 1.392068
elementType: S F O N C H
totalener: -1632.29206211 hartree
nucrepener: 2305.20788185 hartree
electener: -3937.49994396 hartree
oneelecener: -6824.56904898 hartree
twoeener: 2887.06910501 hartree
cpcmener: -0.03622490 hartree
kineticenergy: 1626.69885974 hartree
xcener: -129.804883670498 hartree
chargesum: 0.0000000
charge: 0.859897 -0.175383 -0.178542 -0.178957 -0.136157 -0.420979 -0.544317 -0.537287 -0.194765 -0.163681 -0.128330 -0.126942 0.263839 -0.142326 0.340851 -0.003659 0.116158 -0.112199 -0.195041 -0.027879 -0.081108 -0.098532 -0.246455 0.557051 0.112012 0.102030 0.102014 0.102945 0.099317 0.164137 0.159696 0.137406 0.155417 0.138058 0.140636 0.141074
qa: 0.8599 -0.1754 -0.1785 -0.1790 -0.1362 -0.4210 -0.5443 -0.5373 -0.1948 -0.1637 -0.1283 -0.1269 0.2638 -0.1423 0.3409 -0.0037 0.1162 -0.1122 -0.1950 -0.0279 -0.0811 -0.0985 -0.2465 0.5571 0.1120 0.1020 0.1020 0.1029 0.0993 0.1641 0.1597 0.1374 0.1554 0.1381 0.1406 0.1411
va: 5.5321 1.1316 1.1199 1.1212 2.2589 2.0496 1.9351 1.9220 2.8626 3.8332 3.8935 3.8980 3.8129 3.5285 3.8776 4.0980 3.6026 3.8956 3.9814 3.9381 3.7870 3.9963 3.8579 4.4270 1.0320 1.0207 1.0171 1.0162 1.0214 0.9986 0.9951 1.0420 1.0029 1.0078 1.0107 1.0195
dispcorr: -0.018702233 hartree
energy: -1632.310764339554
dipole: 35.72622 -35.32197 0.40425 -6.21326 6.62979 0.41653 6.42470 -3.91717 2.50753
magnitude: 2.57383 au
magnitude: 6.54216 debye
