program: Gaussian 09
title: 000059490
version: EM64L-G09RevD.01
frameworkgroup: C1[X(C17H25NO3)]
method: RPBEPBE
basis: SDD
operation: Freq
keyword: #p
keyword: freq=noraman
keyword: PBEPBE/SDD
title: #p freq=noraman PBEPBE/SDD
converged: YES YES NO NO
title: Mulliken charges:
elementType: O O O N C C C C C C C C C C C C C C C C C H H H H H H H H H H H H H H H H H H H H H H H H H
charge: -0.489661 -0.266770 -0.262683 -0.083956 -0.192057 -0.494294 -0.520656 0.214190 -0.617355 0.200607 0.471700 -0.389708 -0.419714 -0.274953 -0.414783 -0.229865 -0.234284 -0.311902 -0.245433 -0.615469 -0.624636 0.258230 0.232850 0.252337 0.244401 0.233274 0.240616 0.215030 0.374513 0.269099 0.228822 0.230602 0.239925 0.219205 0.221570 0.223319 0.221569 0.202774 0.187503 0.225809 0.225885 0.223852 0.188314 0.232149 0.187333 0.222704
chargesum: 0.00000
title: Mulliken charges with hydrogens summed into heavy atoms:
elementType: O O O N C C C C C C C C C C C C C C C C C
charge: -0.115148 -0.266770 -0.262683 -0.083956 0.066173 -0.009107 -0.042981 0.214190 -0.161710 0.200607 0.471700 -0.120609 -0.190892 0.195575 0.025992 -0.006547 -0.012716 0.078375 -0.019624 0.022582 0.017550
polarizability: 2.19141807e+02 -5.54206927e+00 2.13509990e+02 3.39152294e+00 1.52115518e+01 1.51701614e+02
1716.lowfreq: -7.4940 -3.5038 -0.0003 0.0005 0.0007 8.0744 13.5867 27.4179 35.3106
frequency: 13.2269 27.3113 35.2177 41.2478 46.8345 60.7408 67.1099 82.7192 101.6557 108.4875 136.8834 162.5181 185.2445 202.6451 226.2098 231.6216 248.8364 249.7696 258.2401 283.8511 311.4357 342.8697 351.8763 366.1049 403.9914 404.7982 409.6047 429.4233 455.5310 467.2500 499.1665 542.9770 588.8426 616.7472 619.6211 696.9307 706.3883 747.5468 762.4654 780.5076 793.8696 804.1761 816.7197 824.8683 851.1546 854.9817 882.0515 882.6851 900.7839 916.6956 924.0877 975.7285 990.1590 993.2233 1000.2408 1012.7391 1021.8605 1027.9664 1031.9532 1039.6139 1049.8051 1053.4132 1078.4890 1081.1632 1083.1609 1094.7602 1104.5647 1108.4574 1125.2815 1141.7212 1166.0592 1169.3005 1171.2549 1171.5025 1187.5808 1204.6934 1217.8768 1229.8189 1235.5621 1247.7860 1263.7590 1296.6044 1301.1558 1328.1621 1330.8720 1341.2303 1361.4703 1376.0981 1382.9996 1384.7905 1421.5225 1422.8879 1439.7621 1443.4433 1452.2463 1455.4444 1458.6361 1463.9322 1468.1285 1471.8794 1475.9238 1480.7969 1483.3275 1486.7516 1591.2490 1603.8740 1614.0094 2843.7955 2846.6227 2865.5032 2997.8515 3002.9774 3005.7383 3011.0067 3019.9966 3031.0283 3060.3133 3067.1780 3078.2320 3081.5668 3087.3669 3099.0306 3105.9076 3113.6279 3124.6187 3126.9294 3136.7933 3151.9801 3164.6883 3201.6413 3219.0109 3440.5234
redmass: 4.3021 4.0198 4.0865 2.6837 3.8382 4.4170 5.0802 4.0652 3.2648 2.5105 3.1742 3.1248 3.6476 4.0839 1.2285 2.2117 2.1610 1.9663 2.5432 4.5603 3.7444 2.3538 2.3176 3.2722 2.7192 2.7915 2.4173 1.3332 2.3486 4.1831 2.8548 4.7553 4.3984 4.7142 3.6069 5.2633 1.8140 1.8422 1.7429 1.3767 2.4265 3.8897 2.6110 1.4905 2.2336 1.2988 3.0386 2.7962 1.9340 3.0287 1.7069 1.3912 5.8494 1.3857 1.9700 2.8289 2.7234 2.2263 1.6457 1.9503 1.2702 3.0688 1.7410 1.4360 1.4876 1.4242 1.1444 1.9402 1.7535 1.5688 2.1320 1.3794 1.3664 1.1472 1.1201 1.9754 2.3354 1.2921 1.7449 1.7593 2.5465 1.4804 1.1764 1.3762 1.2814 1.4925 1.4857 1.8419 5.2851 1.4992 1.1446 1.0887 2.0372 1.1638 1.0789 1.2812 1.2262 1.0511 1.0623 1.0843 1.0659 1.0717 2.2584 1.0658 6.0430 10.3377 6.1497 1.0668 1.0577 1.0592 1.0630 1.0836 1.0594 1.0597 1.0724 1.0721 1.1014 1.1026 1.1016 1.1073 1.1005 1.0508 1.0609 1.0858 1.0871 1.0897 1.0931 1.0958 1.1001 1.1168 1.1152 1.0650
irintensity: 0.1304 0.1016 0.1128 0.2625 0.3077 0.0652 0.1408 0.5149 1.2957 3.6604 0.4279 0.7903 1.0448 0.6213 0.8656 1.9145 4.4192 3.0538 0.8078 11.2584 13.4721 7.6619 8.9489 11.9570 7.9314 5.6273 0.5742 94.9251 12.4439 2.4999 14.1388 9.7866 18.7603 2.6807 7.9462 8.5402 51.6832 10.9996 28.4144 3.7416 2.4322 1.2165 2.3456 16.7422 20.0942 3.7094 3.7238 18.6613 2.9886 2.0304 4.7974 1.2982 0.2273 5.3007 32.1663 3.3383 64.6463 11.7339 19.9981 28.8425 13.1702 43.1080 1.4662 17.0868 2.2329 8.0519 4.8231 46.4152 139.4650 2.6244 206.9037 7.6912 11.3273 15.3409 1.5651 25.4517 10.6642 0.9288 3.5854 51.0360 5.7166 11.1934 4.4573 3.1064 1.3251 1.1613 1.2843 29.5570 0.7456 11.2944 3.3740 9.8652 7.7977 2.7859 7.5177 5.8520 7.8264 18.4889 2.8908 11.7527 6.2105 16.4903 18.5391 33.6422 1.3632 141.1862 8.7113 91.8111 70.1629 214.5082 7.7959 29.6816 21.7603 15.3311 43.7496 49.7258 26.4432 9.6735 23.7972 36.2225 49.5496 19.2540 15.0971 5.9097 1.1225 7.8798 33.7537 29.0561 15.0572 0.3200 16.8160 51.0737
temp: 298.150 k
press: 1.00000 atm
elementType: 8 8 8 7 6 6 6 6 6 6 6 6 6 6 6 6 6 6 6 6 6 1 1 1 1 1 1 1 1 1 1 1 1 1 1 1 1 1 1 1 1 1 1 1 1 1
symmnumber: 1
zpe: 1018184.4 jmol-1
zpe.correction: 0.387806 hartree
zpe.thermalcorrener: 0.410375 hartree
zpe.thermalcorrenthalpy: 0.411320 hartree
zpe.thermalcorrgfe: 0.333315 hartree
zpe.sumelectzpe: -941.559280 hartree
zpe.sumelectthermal: -941.536711 hartree
zpe.sumelectthermalent: -941.535767 hartree
zpe.sumelectthermalfe: -941.613771 hartree
dipole: -2.9045 -0.5432 -0.9508
dipole: 3.1040
quadrupole: -127.0382 -120.1156 -129.6419
quadrupole: 2.2044 1.7330 3.4779
quadrupole: -1.4396 5.4830 -4.0434 2.2044 1.7330 3.4779
hfenergy: -941.9470864 hartree
pointgroup: C01 [X(C17H25N1O3)]
dipole: -1.1455175 -0.1414759 0.3989227 debye
polarizability: 215.0686123|6.4474115|217.2021246|-9.1971144|13.3701331|152.0826743 unknown
InChI: InChI=1S/C17H25NO3/c1-18(2)11-6-12-21-16(19)17(20,15-9-10-15)13-14-7-4-3-5-8-14/h3-5,7-8,15,20H,6,9-13H2,1-2H3
charge 0 multiplicity 1
46 atoms
O  2.707784 1.781136 -0.375938
O  -0.851386 0.951894 -0.646483
O  0.858146 1.144207 -2.214643
N  -4.581063 -1.215645 0.275816
C  0.85338 2.893154 0.785307
C  1.845541 3.817996 1.498398
C  1.211066 4.247594 0.165144
C  1.358743 1.583141 0.157093
C  1.388982 0.449336 1.233048
C  0.447648 1.202531 -1.027251
C  1.756693 -0.924811 0.696519
C  3.089958 -1.221414 0.308139
C  0.771899 -1.938663 0.569421
C  -1.803571 0.571013 -1.745511
C  -3.171965 0.349515 -1.106915
C  3.426736 -2.497684 -0.194915
C  1.106622 -3.217596 0.068713
C  -3.205805 -0.859199 -0.148467
C  2.43697 -3.501304 -0.316425
C  -4.625078 -2.550067 0.911047
C  -5.211964 -0.188561 1.131497
H  -0.146207 2.798333 1.223568
H  1.52154 4.310176 2.420079
H  2.90031 3.532763 1.460579
H  1.868561 4.241787 -0.708298
H  0.449434 5.032376 0.171786
H  2.122609 0.785176 1.989104
H  0.396632 0.417018 1.718174
H  2.666953 1.60578 -1.357903
H  3.853208 -0.441762 0.3992
H  -0.260931 -1.723899 0.871529
H  -1.407181 -0.338619 -2.232969
H  -1.81219 1.391939 -2.484375
H  -3.904991 0.168892 -1.917221
H  -3.4764 1.277655 -0.589329
H  4.460636 -2.711355 -0.489698
H  0.334766 -3.991576 -0.015515
H  -2.784989 -1.736747 -0.678603
H  -2.538325 -0.655633 0.729018
H  2.700264 -4.492704 -0.702344
H  -4.22833 -3.308629 0.212827
H  -5.671641 -2.815678 1.144145
H  -4.034604 -2.610564 1.861173
H  -5.291393 0.769999 0.591571
H  -4.651354 -0.00631 2.084609
H  -6.235812 -0.509592 1.393096
