program: Orca
programVersion: 5.0.2
elementType: S F F F O O O O N C C C C C C C C C C C C C C C H H H H H H H H H H H H
charge: 0
multiplicity: 1
keywords: wb97x-d3
keywords: def2-TZVPP
keywords: def2/J RIJCOSX
keywords: DEFGRID2
keywords: scfconv7
keywords: smallprint printgap noloewdin
keywords: NOSOSCF
formula: C15H12F3NO4S
InChI: InChI=1/C15H12F3NO4S/c1-24(21,22)12-6-9(15(16,17)18)4-5-10(12)13(20)11-7-19-23-14(11)8-2-3-8/h4-8H,2-3H2,1H3
36 atoms
S  -0.302716 -2.287062 -0.767038
F  -5.054024 -0.212261 -0.377633
F  -4.959953 0.961759 1.425667
F  -4.674619 1.903921 -0.484359
O  3.928903 1.806715 -0.900619
O  1.691245 -0.800023 1.591121
O  -1.309685 -2.845137 -1.653771
O  1.016514 -1.928568 -1.259922
N  2.855458 2.286157 -1.610853
C  4.54834 0.301503 0.84662
C  5.870607 -0.111682 0.240192
C  5.827793 1.026972 1.189264
C  3.537527 0.936392 0.01402
C  2.170166 0.818759 -0.04831
C  1.301836 -0.029664 0.742295
C  1.821661 1.699727 -1.107779
C  -0.18088 0.155197 0.533388
C  -1.001192 -0.807592 -0.041044
C  -0.767165 1.324323 1.005072
C  -2.368471 -0.614197 -0.161515
C  -2.938384 0.550841 0.322612
C  -2.133555 1.520398 0.908301
C  -0.121636 -3.398384 0.61741
C  -4.415875 0.795491 0.215946
H  4.133195 -0.353019 1.598704
H  6.031012 0.099388 -0.808411
H  6.274591 -1.057999 0.573085
H  6.204456 0.88451 2.193125
H  5.966311 2.025724 0.797656
H  0.843825 1.907615 -1.515499
H  -0.14812 2.090027 1.45556
H  -2.969514 -1.370174 -0.648025
H  -2.563538 2.438222 1.287926
H  -1.101507 -3.609009 1.039593
H  0.314162 -4.317289 0.225997
H  0.535098 -2.958777 1.362782
totalener: -1632.26860702 hartree
nucrepener: 2308.24439516 hartree
electener: -3940.51300218 hartree
oneelecener: -6830.44592756 hartree
twoeener: 2889.93292539 hartree
kineticenergy: 1626.76098571 hartree
xcener: -129.809494112090 hartree
chargesum: 0.0000000
charge: 0.836446 -0.165719 -0.168303 -0.167272 -0.123107 -0.370274 -0.475758 -0.467268 -0.142038 -0.131469 -0.115092 -0.112251 0.210874 -0.131753 0.299289 -0.010102 0.107554 -0.138145 -0.185831 -0.042381 -0.095272 -0.094076 -0.278628 0.548763 0.105686 0.093064 0.086049 0.086277 0.091415 0.132366 0.137976 0.151585 0.132035 0.120690 0.128910 0.145760
qa: 0.8364 -0.1657 -0.1683 -0.1673 -0.1231 -0.3703 -0.4758 -0.4673 -0.1420 -0.1315 -0.1151 -0.1123 0.2109 -0.1318 0.2993 -0.0101 0.1076 -0.1381 -0.1858 -0.0424 -0.0953 -0.0941 -0.2786 0.5488 0.1057 0.0931 0.0860 0.0863 0.0914 0.1324 0.1380 0.1516 0.1320 0.1207 0.1289 0.1458
va: 5.5836 1.1447 1.1339 1.1363 2.2841 2.0922 2.0145 1.9982 2.8849 3.8343 3.9038 3.8922 3.8967 3.5142 3.9199 4.0922 3.6341 3.9396 3.9885 3.9222 3.8487 4.0382 3.8705 4.4410 1.0350 1.0256 1.0209 1.0198 1.0249 1.0065 1.0044 1.0417 1.0128 1.0133 1.0157 1.0196
dispcorr: -0.018777461 hartree
energy: -1632.287384480071
dipole: 35.91835 -35.30321 0.61514 -6.26843 6.42135 0.15292 6.57722 -4.80657 1.77064
magnitude: 1.88068 au
magnitude: 4.78031 debye
