program: Orca
programVersion: 5.0.2
elementType: S F F F O O O O N C C C C C C C C C C C C C C C H H H H H H H H H H H H
charge: 0
multiplicity: 1
keywords: wb97x-d3
keywords: def2-TZVPP
keywords: def2/J RIJCOSX
keywords: DEFGRID2
keywords: scfconv7
keywords: smallprint printgap noloewdin
keywords: NOSOSCF
formula: C15H12F3NO4S
InChI: InChI=1/C15H12F3NO4S/c1-24(21,22)12-6-9(15(16,17)18)4-5-10(12)13(20)11-7-19-23-14(11)8-2-3-8/h4-8H,2-3H2,1H3
36 atoms
S  -0.401074 -2.330629 0.768876
F  -5.045432 -0.043573 -1.025414
F  -4.844501 0.706876 0.977931
F  -4.742023 2.060083 -0.694854
O  3.971785 1.742675 0.934306
O  1.690438 -0.877713 -1.502813
O  0.922625 -2.030481 1.28834
O  -1.442194 -2.86512 1.630054
N  2.9166 2.193248 1.689665
C  4.54761 0.289494 -0.87227
C  5.766195 1.075591 -1.296094
C  5.92323 -0.057455 -0.352114
C  3.561217 0.883217 0.017904
C  2.199096 0.744253 0.124531
C  1.314902 -0.092359 -0.661763
C  1.874214 1.601702 1.210664
C  -0.162496 0.137913 -0.470047
C  -1.032706 -0.81298 0.056113
C  -0.69214 1.337508 -0.922315
C  -2.392262 -0.573902 0.13637
C  -2.909427 0.623781 -0.342143
C  -2.056792 1.579849 -0.868454
C  -0.23933 -3.427267 -0.629033
C  -4.392685 0.845139 -0.270772
H  4.116763 -0.384788 -1.597581
H  5.879402 2.080992 -0.913504
H  6.083961 0.949458 -2.322247
H  6.350375 -0.983831 -0.710779
H  6.140891 0.164151 0.683881
H  0.907735 1.787545 1.654562
H  -0.033509 2.094119 -1.329673
H  -3.037455 -1.317642 0.587248
H  -2.43992 2.52103 -1.236599
H  -1.220581 -3.601955 -1.064101
H  0.43952 -2.998108 -1.360447
H  0.16367 -4.364057 -0.244932
totalener: -1632.26862377 hartree
nucrepener: 2305.80668325 hartree
electener: -3938.07530702 hartree
oneelecener: -6825.56091595 hartree
twoeener: 2887.48560892 hartree
kineticenergy: 1626.76433412 hartree
xcener: -129.810072591874 hartree
chargesum: 0.0000000
charge: 0.836712 -0.166628 -0.163875 -0.170408 -0.123302 -0.370598 -0.466731 -0.475280 -0.141628 -0.130745 -0.112822 -0.115182 0.213115 -0.133170 0.301411 -0.009721 0.091751 -0.135814 -0.186341 -0.064695 -0.096002 -0.065199 -0.277936 0.547888 0.107193 0.091418 0.086291 0.086373 0.092531 0.133484 0.138730 0.138171 0.145810 0.121008 0.145157 0.129035
qa: 0.8367 -0.1666 -0.1639 -0.1704 -0.1233 -0.3706 -0.4667 -0.4753 -0.1416 -0.1307 -0.1128 -0.1152 0.2131 -0.1332 0.3014 -0.0097 0.0918 -0.1358 -0.1863 -0.0647 -0.0960 -0.0652 -0.2779 0.5479 0.1072 0.0914 0.0863 0.0864 0.0925 0.1335 0.1387 0.1382 0.1458 0.1210 0.1452 0.1290
va: 5.5817 1.1369 1.1424 1.1379 2.2832 2.0921 2.0005 2.0148 2.8831 3.8316 3.8909 3.9051 3.8880 3.5137 3.9137 4.0914 3.6415 3.9334 4.0056 4.0390 3.8460 3.9401 3.8703 4.4457 1.0343 1.0249 1.0198 1.0207 1.0256 1.0064 1.0038 1.0460 1.0088 1.0133 1.0198 1.0156
dispcorr: -0.018698957 hartree
energy: -1632.287322727308
dipole: 35.76558 -35.12409 0.64149 -6.04683 6.31558 0.26875 -6.71027 4.90011 -1.81016
magnitude: 1.93918 au
magnitude: 4.92901 debye
