program: Orca
programVersion: 5.0.2
elementType: S F F F O O O O N C C C C C C C C C C C C C C C H H H H H H H H H H H H
charge: 0
multiplicity: 1
keywords: wb97x-d3
keywords: def2-TZVPP
keywords: def2/J RIJCOSX
keywords: DEFGRID2
keywords: scfconv7
keywords: smallprint printgap noloewdin
keywords: NOSOSCF
formula: C15H12F3NO4S
InChI: InChI=1/C15H12F3NO4S/c1-24(21,22)12-6-9(15(16,17)18)4-5-10(12)13(20)11-7-19-23-14(11)8-2-3-8/h4-8H,2-3H2,1H3
36 atoms
S  -0.546806 -2.465512 -0.643009
F  -4.553427 1.681696 -0.835845
F  -5.101877 -0.030261 0.344853
F  -4.671215 1.852838 1.300117
O  3.915641 1.618971 -1.145301
O  1.759077 -0.994696 1.42287
O  -1.682157 -3.028192 -1.354585
O  0.712538 -2.211421 -1.322156
N  2.844045 1.942153 -1.941136
C  4.557735 0.37104 0.785929
C  5.993082 0.199473 0.349709
C  5.635591 1.330228 1.240125
C  3.548075 0.809876 -0.166446
C  2.198116 0.580657 -0.270052
C  1.346852 -0.227224 0.582897
C  1.832911 1.332282 -1.420213
C  -0.133053 0.039378 0.465099
C  -1.071034 -0.893103 0.035381
C  -0.58508 1.286219 0.878174
C  -2.421652 -0.588571 -0.00798
C  -2.855646 0.660482 0.411147
C  -1.934031 1.595758 0.858885
C  -0.249138 -3.496201 0.783419
C  -4.30528 1.037453 0.307893
H  4.181308 -0.328802 1.517754
H  6.238392 0.415657 -0.681239
H  6.52114 -0.647215 0.766615
H  5.91258 1.282702 2.28463
H  5.631593 2.328464 0.823333
H  0.861385 1.421795 -1.882406
H  0.127406 2.027862 1.216155
H  -3.118375 -1.325152 -0.385818
H  -2.255962 2.574124 1.188686
H  0.516576 -3.054006 1.413598
H  -1.179187 -3.623506 1.332401
H  0.08629 -4.460881 0.403134
totalener: -1632.26837192 hartree
nucrepener: 2303.62984752 hartree
electener: -3935.89821943 hartree
oneelecener: -6821.15976963 hartree
twoeener: 2885.26155019 hartree
kineticenergy: 1626.76307018 hartree
xcener: -129.809650115371 hartree
chargesum: 0.0000000
charge: 0.837269 -0.162281 -0.166582 -0.170816 -0.123329 -0.368132 -0.476800 -0.466132 -0.141098 -0.129186 -0.113446 -0.116793 0.216108 -0.141130 0.291755 -0.006413 0.071459 -0.124132 -0.171216 -0.059098 -0.071642 -0.091879 -0.280259 0.542923 0.107037 0.092497 0.087173 0.086244 0.091881 0.135018 0.136158 0.147920 0.137488 0.148829 0.121491 0.129115
qa: 0.8373 -0.1623 -0.1666 -0.1708 -0.1233 -0.3681 -0.4768 -0.4661 -0.1411 -0.1292 -0.1134 -0.1168 0.2161 -0.1411 0.2918 -0.0064 0.0715 -0.1241 -0.1712 -0.0591 -0.0716 -0.0919 -0.2803 0.5429 0.1070 0.0925 0.0872 0.0862 0.0919 0.1350 0.1362 0.1479 0.1375 0.1488 0.1215 0.1291
va: 5.5826 1.1355 1.1423 1.1344 2.2816 2.0912 2.0136 1.9997 2.8813 3.8309 3.9054 3.8903 3.8781 3.5176 3.9252 4.0903 3.6622 3.9438 3.9914 3.9851 3.8174 4.0169 3.8687 4.4431 1.0326 1.0258 1.0203 1.0201 1.0247 1.0069 1.0036 1.0439 1.0120 1.0191 1.0138 1.0159
dispcorr: -0.018682682 hartree
energy: -1632.287054600357
dipole: 35.72982 -34.92232 0.80749 -6.08010 6.46371 0.38360 6.83647 -4.96089 1.87558
magnitude: 2.07773 au
magnitude: 5.28118 debye
