program: Orca
programVersion: 5.0.2
elementType: Cl O O O O O N N C C C C C C C C C C C C C C C C C C C C C C H H H H H H H H H H H H H H H H H
charge: 0
multiplicity: 1
keywords: wb97x-d3
keywords: def2-TZVPP
keywords: def2/J RIJCOSX
keywords: DEFGRID2
keywords: scfconv7
keywords: smallprint printgap noloewdin
keywords: NOSOSCF
formula: C22H17ClN2O5
InChI: InChI=1/C22H17ClN2O5/c1-30-13-10-8-12(9-11-13)25-15-5-2-4-14(23)19(15)24-20(22(25)29)21(28)18-16(26)6-3-7-17(18)27/h2,4-5,8-11,26H,3,6-7H2,1H3
47 atoms
Cl -2.201632 -4.290662 0.30262
O  -4.483063 2.270442 -1.65594
O  -1.29627 1.190664 1.608043
O  -2.996915 0.279481 -1.986583
O  0.242865 1.494399 -1.001389
O  6.113459 1.883903 0.201337
N  1.10279 -0.457376 -0.209183
N  -1.461241 -1.507878 -0.282666
C  -2.810329 1.684038 -0.110598
C  -3.957755 3.602902 1.678666
C  -4.284797 3.707551 0.199855
C  -2.499581 3.224242 1.874451
C  -3.847742 2.500984 -0.548348
C  -2.136952 1.955763 1.154709
C  -2.413888 0.57569 -0.939648
C  -1.244456 -0.278569 -0.550034
C  0.078819 0.349358 -0.611281
C  0.906957 -1.783225 0.144582
C  -0.398874 -2.296146 0.069702
C  2.405104 0.127922 -0.135489
C  1.962094 -2.59681 0.55684
C  -0.608536 -3.645246 0.393765
C  2.747047 0.87421 0.983903
C  3.308652 -0.037858 -1.167113
C  1.71322 -3.916513 0.868795
C  0.431465 -4.456582 0.785825
C  3.997239 1.451586 1.067671
C  4.571025 0.534997 -1.088595
C  4.9196 1.285437 0.031504
C  7.097808 1.732757 -0.805964
H  -4.166196 4.553647 2.167145
H  -4.602282 2.855344 2.145578
H  -3.759074 4.561961 -0.243349
H  -5.349124 3.872749 0.028931
H  -2.247103 3.120267 2.929505
H  -1.856442 4.012897 1.466138
H  2.966753 -2.20686 0.630584
H  2.034398 1.005949 1.787848
H  3.040291 -0.61984 -2.038737
H  2.531739 -4.548444 1.184877
H  0.257813 -5.494553 1.031583
H  4.26919 2.035811 1.936797
H  5.260138 0.386987 -1.907943
H  6.770987 2.148813 -1.760786
H  7.37571 0.686535 -0.948957
H  7.971865 2.282547 -0.466437
H  -4.088203 1.454931 -2.080797
elementType: Cl O N C H
totalener: -1794.56838116 hartree
nucrepener: 3020.76987379 hartree
electener: -4815.33825496 hartree
oneelecener: -8463.48650023 hartree
twoeener: 3648.14824528 hartree
cpcmener: -0.05502002 hartree
kineticenergy: 1788.43898880 hartree
xcener: -147.627128501979 hartree
chargesum: -0.0000000
charge: -0.067848 -0.303569 -0.495467 -0.449206 -0.513786 -0.333374 0.081731 -0.269904 -0.323201 -0.135699 -0.077947 -0.094901 0.327980 0.355029 0.319630 0.147617 0.327462 0.143897 0.091404 0.020048 -0.173167 -0.001687 -0.203864 -0.239128 -0.128979 -0.151150 -0.155424 -0.144428 0.310299 -0.119226 0.085534 0.086774 0.114169 0.100156 0.085476 0.105146 0.158583 0.145500 0.154795 0.164954 0.140919 0.142978 0.146293 0.114382 0.114528 0.124520 0.272152
qa: -0.0678 -0.3036 -0.4955 -0.4492 -0.5138 -0.3334 0.0817 -0.2699 -0.3232 -0.1357 -0.0779 -0.0949 0.3280 0.3550 0.3196 0.1476 0.3275 0.1439 0.0914 0.0200 -0.1732 -0.0017 -0.2039 -0.2391 -0.1290 -0.1511 -0.1554 -0.1444 0.3103 -0.1192 0.0855 0.0868 0.1142 0.1002 0.0855 0.1051 0.1586 0.1455 0.1548 0.1650 0.1409 0.1430 0.1463 0.1144 0.1145 0.1245 0.2722
va: 1.2518 2.2644 1.9857 2.0612 1.9972 2.0682 3.1823 3.0951 3.4904 3.9295 3.9450 3.9136 3.8887 3.8912 3.9005 3.9094 4.1351 3.8693 3.9450 3.5145 3.8787 3.8957 4.0889 4.0938 3.9399 3.9905 3.9485 3.7880 3.7993 3.8557 1.0118 1.0078 1.0058 1.0200 1.0277 1.0063 1.0002 1.0178 1.0089 0.9871 1.0077 1.0107 1.0109 0.9866 0.9872 0.9936 1.0526
dispcorr: -0.024956319 hartree
energy: -1794.593337482739
dipole: 17.82583 -16.17884 1.64699 24.38252 -23.41382 0.96870 4.67945 -3.98907 0.69038
magnitude: 2.03164 au
magnitude: 5.16403 debye
