program: Orca
programVersion: 5.0.2
elementType: Cl O O O O O N N C C C C C C C C C C C C C C C C C C C C C C H H H H H H H H H H H H H H H H H
charge: 0
multiplicity: 1
keywords: wb97x-d3
keywords: def2-TZVPP
keywords: def2/J RIJCOSX
keywords: DEFGRID2
keywords: scfconv7
keywords: smallprint printgap noloewdin
keywords: NOSOSCF
formula: C22H17ClN2O5
InChI: InChI=1/C22H17ClN2O5/c1-30-13-10-8-12(9-11-13)25-15-5-2-4-14(23)19(15)24-20(22(25)29)21(28)18-16(26)6-3-7-17(18)27/h2,4-5,8-11,26H,3,6-7H2,1H3
47 atoms
Cl -2.195691 -4.351372 -0.278918
O  -4.482109 2.299167 1.550428
O  -1.241904 1.141886 -1.631008
O  -3.100538 0.232042 1.882226
O  0.199154 1.445536 1.040156
O  6.017627 2.004078 -0.122684
N  1.079143 -0.493003 0.237197
N  -1.482484 -1.555002 0.271413
C  -2.778581 1.675858 0.054395
C  -3.765999 3.695745 -1.722871
C  -4.139297 3.777045 -0.253249
C  -2.324474 3.243282 -1.8819
C  -3.792487 2.529601 0.475302
C  -2.05275 1.941822 -1.18293
C  -2.454035 0.538086 0.876303
C  -1.275309 -0.323201 0.535282
C  0.045676 0.305531 0.63104
C  0.895345 -1.822147 -0.110554
C  -0.408816 -2.341968 -0.048735
C  2.372478 0.112116 0.16788
C  1.95995 -2.632586 -0.503618
C  -0.605489 -3.696296 -0.35894
C  2.689949 0.894716 -0.93514
C  3.283371 -0.052259 1.193979
C  1.723284 -3.957495 -0.803243
C  0.444417 -4.505653 -0.727673
C  3.920384 1.514867 -1.005814
C  4.526799 0.561991 1.127316
C  4.847541 1.355395 0.027551
C  7.000586 1.869283 0.888856
H  -4.433443 2.998687 -2.233952
H  -3.904869 4.670285 -2.189239
H  -5.199075 3.994521 -0.115334
H  -3.585714 4.590481 0.231298
H  -1.652754 3.986082 -1.434722
H  -2.044343 3.150058 -2.930914
H  2.962848 -2.236694 -0.57024
H  1.971582 1.026363 -1.734619
H  3.034675 -0.662345 2.052883
H  2.549289 -4.587759 -1.102872
H  0.280963 -5.547914 -0.962149
H  4.170566 2.130342 -1.860796
H  5.222005 0.41537 1.942237
H  7.324072 0.83216 1.006107
H  6.64829 2.244744 1.852424
H  7.851726 2.46658 0.571245
H  -4.148125 1.450994 1.962153
elementType: Cl O N C H
totalener: -1794.56797744 hartree
nucrepener: 3024.92157343 hartree
electener: -4819.48955087 hartree
oneelecener: -8471.78038950 hartree
twoeener: 3652.29083863 hartree
cpcmener: -0.05459461 hartree
kineticenergy: 1788.42302211 hartree
xcener: -147.624219445789 hartree
chargesum: -0.0000000
charge: -0.067879 -0.304079 -0.494905 -0.447977 -0.511549 -0.332931 0.081946 -0.268033 -0.320901 -0.135891 -0.077296 -0.091757 0.328559 0.352095 0.316169 0.145984 0.321164 0.144869 0.090473 0.022544 -0.174371 -0.000802 -0.201759 -0.238488 -0.127433 -0.151638 -0.159314 -0.145916 0.310764 -0.119030 0.086655 0.085544 0.099980 0.114306 0.104795 0.085098 0.159352 0.144991 0.155863 0.164950 0.140964 0.143139 0.146332 0.114651 0.114063 0.124488 0.272211
qa: -0.0679 -0.3041 -0.4949 -0.4480 -0.5115 -0.3329 0.0819 -0.2680 -0.3209 -0.1359 -0.0773 -0.0918 0.3286 0.3521 0.3162 0.1460 0.3212 0.1449 0.0905 0.0225 -0.1744 -0.0008 -0.2018 -0.2385 -0.1274 -0.1516 -0.1593 -0.1459 0.3108 -0.1190 0.0867 0.0855 0.1000 0.1143 0.1048 0.0851 0.1594 0.1450 0.1559 0.1649 0.1410 0.1431 0.1463 0.1147 0.1141 0.1245 0.2722
va: 1.2517 2.2638 1.9843 2.0625 1.9987 2.0685 3.1836 3.0946 3.4800 3.9301 3.9432 3.9100 3.8901 3.8926 3.9037 3.9127 4.1318 3.8673 3.9436 3.5124 3.8812 3.8948 4.0823 4.0924 3.9384 3.9903 3.9561 3.7893 3.7978 3.8553 1.0077 1.0115 1.0201 1.0055 1.0064 1.0278 0.9996 1.0201 1.0081 0.9871 1.0077 1.0105 1.0108 0.9870 0.9868 0.9937 1.0521
dispcorr: -0.025069373 hartree
energy: -1794.593046810561
dipole: 18.43557 -16.62363 1.81194 25.27436 -24.18188 1.09248 -4.49724 3.84679 -0.65045
magnitude: 2.21353 au
magnitude: 5.62635 debye
