program: Orca
programVersion: 5.0.2
elementType: Cl O O O O O N N C C C C C C C C C C C C C C C C C C C C C C H H H H H H H H H H H H H H H H H
charge: 0
multiplicity: 1
keywords: wb97x-d3
keywords: def2-TZVPP
keywords: def2/J RIJCOSX
keywords: DEFGRID2
keywords: scfconv7
keywords: smallprint printgap noloewdin
keywords: NOSOSCF
formula: C22H17ClN2O5
InChI: InChI=1/C22H17ClN2O5/c1-30-13-10-8-12(9-11-13)25-15-5-2-4-14(23)19(15)24-20(22(25)29)21(28)18-16(26)6-3-7-17(18)27/h2,4-5,8-11,26H,3,6-7H2,1H3
47 atoms
Cl -2.190583 -4.407128 0.277761
O  -4.550981 2.340265 -1.281117
O  -1.079721 1.093548 1.614806
O  -3.284644 0.204058 -1.693681
O  0.111269 1.401835 -1.15833
O  6.01614 1.904733 -0.384652
N  1.042524 -0.550606 -0.457551
N  -1.516664 -1.600557 -0.281824
C  -2.748075 1.661135 0.071668
C  -3.51366 3.729334 1.910066
C  -4.009324 3.808182 0.477151
C  -2.084769 3.217984 1.960008
C  -3.764455 2.545899 -0.267417
C  -1.911933 1.909604 1.240862
C  -2.529439 0.506971 -0.767374
C  -1.329107 -0.366168 -0.549849
C  -0.017061 0.257843 -0.754173
C  0.883164 -1.881672 -0.110422
C  -0.423773 -2.396695 -0.067544
C  2.335273 0.059519 -0.432077
C  1.975417 -2.700896 0.1741
C  -0.598348 -3.754886 0.24042
C  3.096093 0.166376 -1.587539
C  2.803551 0.572071 0.763775
C  1.759981 -4.027071 0.483448
C  0.476804 -4.569665 0.513342
C  4.328347 0.788523 -1.538664
C  4.041349 1.19498 0.822754
C  4.808935 1.309271 -0.334522
C  6.540403 2.468154 0.804952
H  -3.57216 4.714866 2.369955
H  -4.163498 3.0688 2.487497
H  -3.483299 4.603487 -0.064072
H  -5.071884 4.050274 0.432648
H  -1.735327 3.104914 2.986335
H  -1.41465 3.935558 1.471539
H  2.981892 -2.30898 0.148877
H  2.730598 -0.232415 -2.524734
H  2.201237 0.490573 1.659741
H  2.605945 -4.663298 0.704508
H  0.329472 -5.613737 0.750723
H  4.926526 0.880452 -2.436236
H  4.380859 1.585764 1.771603
H  7.50087 2.904257 0.541823
H  6.697902 1.712902 1.578601
H  5.8950 3.255672 1.2012
H  -4.297253 1.473949 -1.706145
elementType: Cl O N C H
totalener: -1794.56751330 hartree
nucrepener: 3028.13265655 hartree
electener: -4822.70016986 hartree
oneelecener: -8478.16659192 hartree
twoeener: 3655.46642206 hartree
cpcmener: -0.05434549 hartree
kineticenergy: 1788.41884690 hartree
xcener: -147.622977715315 hartree
chargesum: -0.0000000
charge: -0.067397 -0.304964 -0.494011 -0.447027 -0.511101 -0.333962 0.080459 -0.265997 -0.320126 -0.138215 -0.075924 -0.088084 0.329960 0.345217 0.316993 0.151107 0.311052 0.146028 0.096464 0.021347 -0.170309 -0.004281 -0.206243 -0.236738 -0.131396 -0.149682 -0.147432 -0.151066 0.312358 -0.119348 0.084985 0.086549 0.114490 0.099938 0.084906 0.105054 0.157946 0.149127 0.149283 0.164906 0.140841 0.142276 0.145936 0.124803 0.114336 0.114387 0.272554
qa: -0.0674 -0.3050 -0.4940 -0.4470 -0.5111 -0.3340 0.0805 -0.2660 -0.3201 -0.1382 -0.0759 -0.0881 0.3300 0.3452 0.3170 0.1511 0.3111 0.1460 0.0965 0.0213 -0.1703 -0.0043 -0.2062 -0.2367 -0.1314 -0.1497 -0.1474 -0.1511 0.3124 -0.1193 0.0850 0.0865 0.1145 0.0999 0.0849 0.1051 0.1579 0.1491 0.1493 0.1649 0.1408 0.1423 0.1459 0.1248 0.1143 0.1144 0.2726
va: 1.2524 2.2633 1.9862 2.0624 2.0002 2.0683 3.1777 3.0927 3.4698 3.9328 3.9382 3.9051 3.8855 3.9037 3.9086 3.9143 4.1384 3.8612 3.9357 3.5211 3.8737 3.9003 4.1033 4.0960 3.9405 3.9880 3.9302 3.8024 3.7963 3.8562 1.0118 1.0072 1.0054 1.0203 1.0280 1.0065 1.0005 1.0083 1.0184 0.9872 1.0076 1.0104 1.0115 0.9936 0.9867 0.9872 1.0496
dispcorr: -0.025083062 hartree
energy: -1794.592596363236
dipole: 18.06684 -16.38041 1.68644 27.48351 -25.95031 1.53321 10.21005 -8.31882 1.89123
magnitude: 2.96168 au
magnitude: 7.52799 debye
