program: Orca
programVersion: 5.0.2
elementType: Cl O O O O O N N C C C C C C C C C C C C C C C C C C C C C C H H H H H H H H H H H H H H H H H
charge: 0
multiplicity: 1
keywords: wb97x-d3
keywords: def2-TZVPP
keywords: def2/J RIJCOSX
keywords: DEFGRID2
keywords: scfconv7
keywords: smallprint printgap noloewdin
keywords: NOSOSCF
formula: C22H17ClN2O5
InChI: InChI=1/C22H17ClN2O5/c1-30-13-10-8-12(9-11-13)25-15-5-2-4-14(23)19(15)24-20(22(25)29)21(28)18-16(26)6-3-7-17(18)27/h2,4-5,8-11,26H,3,6-7H2,1H3
47 atoms
Cl -2.217931 -4.316041 0.311908
O  -4.483446 2.27468 -1.605944
O  -1.228113 1.178011 1.580597
O  -3.073408 0.229916 -1.92953
O  0.225386 1.440458 -1.064092
O  6.038985 1.965905 0.188889
N  1.089243 -0.49169 -0.228175
N  -1.476628 -1.541857 -0.279569
C  -2.776653 1.679665 -0.103682
C  -3.790551 3.691849 1.665179
C  -4.172102 3.758602 0.196422
C  -2.340112 3.266069 1.820858
C  -3.801916 2.514661 -0.52925
C  -2.050893 1.961156 1.131908
C  -2.438119 0.540485 -0.920203
C  -1.262241 -0.317593 -0.559301
C  0.063151 0.308559 -0.646936
C  0.895063 -1.814992 0.132756
C  -0.411447 -2.329138 0.065421
C  2.383855 0.107049 -0.146548
C  1.950566 -2.62896 0.543579
C  -0.621536 -3.676599 0.394376
C  2.713328 0.847045 0.981699
C  3.286481 -0.023443 -1.184206
C  1.701728 -3.948242 0.85921
C  0.419776 -4.488378 0.783386
C  3.948013 1.456514 1.066567
C  4.533787 0.581495 -1.104671
C  4.867762 1.331332 0.021575
C  7.01454 1.876085 -0.831211
H  -3.947006 4.665837 2.128349
H  -4.44323 2.985154 2.183105
H  -3.64155 4.583537 -0.294976
H  -5.237803 3.951081 0.062675
H  -2.05249 3.187167 2.869568
H  -1.683173 4.016238 1.363848
H  2.956131 -2.23966 0.612132
H  1.999464 0.951851 1.789398
H  3.025453 -0.598605 -2.063659
H  2.521674 -4.58023 1.172819
H  0.246819 -5.525933 1.03245
H  4.209093 2.038388 1.941718
H  5.221281 0.462828 -1.930823
H  7.869216 2.456814 -0.49096
H  6.659871 2.297684 -1.77546
H  7.338519 0.845367 -0.99933
H  -4.13387 1.431221 -2.018051
elementType: Cl O N C H
totalener: -1794.57395996 hartree
nucrepener: 3025.22027139 hartree
electener: -4819.79423135 hartree
oneelecener: -8472.11379513 hartree
twoeener: 3652.31956378 hartree
cpcmener: -0.04406021 hartree
kineticenergy: 1788.44484934 hartree
xcener: -147.625065704090 hartree
chargesum: -0.0000000
charge: -0.065614 -0.299515 -0.466438 -0.429469 -0.475532 -0.319953 0.078041 -0.263770 -0.319549 -0.139233 -0.079229 -0.093859 0.318841 0.337634 0.302021 0.154478 0.299416 0.141210 0.090484 0.022191 -0.173643 -0.001829 -0.199084 -0.236814 -0.128757 -0.152024 -0.152835 -0.144992 0.306740 -0.121937 0.084754 0.086274 0.111829 0.099109 0.084951 0.102706 0.156237 0.141649 0.150341 0.160777 0.138279 0.139590 0.142421 0.123126 0.112804 0.112315 0.265856
qa: -0.0656 -0.2995 -0.4664 -0.4295 -0.4755 -0.3200 0.0780 -0.2638 -0.3195 -0.1392 -0.0792 -0.0939 0.3188 0.3376 0.3020 0.1545 0.2994 0.1412 0.0905 0.0222 -0.1736 -0.0018 -0.1991 -0.2368 -0.1288 -0.1520 -0.1528 -0.1450 0.3067 -0.1219 0.0848 0.0863 0.1118 0.0991 0.0850 0.1027 0.1562 0.1416 0.1503 0.1608 0.1383 0.1396 0.1424 0.1231 0.1128 0.1123 0.2659
va: 1.2541 2.2691 2.0184 2.0866 2.0453 2.0833 3.1613 3.0971 3.4743 3.9291 3.9390 3.9016 3.8960 3.9151 3.9271 3.8876 4.1696 3.8739 3.9435 3.5246 3.8831 3.9032 4.0915 4.1037 3.9415 3.9925 3.9506 3.7875 3.8137 3.8620 1.0116 1.0075 1.0060 1.0204 1.0282 1.0067 1.0016 1.0209 1.0107 0.9886 1.0090 1.0117 1.0121 0.9941 0.9866 0.9868 1.0609
dispcorr: -0.025066342 hartree
energy: -1794.599026302867
dipole: 18.31231 -16.60141 1.71089 25.19705 -24.03975 1.15731 4.49845 -3.84734 0.65111
magnitude: 2.16575 au
magnitude: 5.50489 debye
