program: Orca
programVersion: 5.0.2
elementType: Cl O O O O O N N C C C C C C C C C C C C C C C C C C C C C C H H H H H H H H H H H H H H H H H
charge: 0
multiplicity: 1
keywords: wb97x-d3
keywords: def2-TZVPP
keywords: def2/J RIJCOSX
keywords: DEFGRID2
keywords: scfconv7
keywords: smallprint printgap noloewdin
keywords: NOSOSCF
formula: C22H17ClN2O5
InChI: InChI=1/C22H17ClN2O5/c1-30-13-10-8-12(9-11-13)25-15-5-2-4-14(23)19(15)24-20(22(25)29)21(28)18-16(26)6-3-7-17(18)27/h2,4-5,8-11,26H,3,6-7H2,1H3
47 atoms
Cl -2.152842 -4.445223 -0.192182
O  -4.554811 2.248962 1.413267
O  -1.270108 1.071728 -1.707319
O  -3.261314 0.111599 1.699773
O  0.111539 1.432122 0.970784
O  5.914902 2.07455 -0.236856
N  1.04371 -0.518245 0.265679
N  -1.496894 -1.623129 0.266876
C  -2.80358 1.632497 -0.029983
C  -2.862869 4.264098 -1.093048
C  -4.069722 3.792757 -0.299674
C  -2.368051 3.158475 -2.008391
C  -3.799185 2.503396 0.389225
C  -2.067464 1.884404 -1.26442
C  -2.536932 0.458874 0.766387
C  -1.3243 -0.380007 0.491174
C  -0.015577 0.279515 0.603265
C  0.895547 -1.865113 -0.017197
C  -0.402118 -2.404149 0.01799
C  2.322724 0.111595 0.171113
C  1.988603 -2.679547 -0.313461
C  -0.568176 -3.774405 -0.236681
C  2.746413 0.587767 -1.062678
C  3.111767 0.279343 1.292302
C  1.782514 -4.020661 -0.559243
C  0.508416 -4.583596 -0.520007
C  3.961425 1.23208 -1.170494
C  4.332994 0.932413 1.194204
C  4.761151 1.417029 -0.039984
C  6.73923 2.351837 0.877965
H  -3.127526 5.145332 -1.67648
H  -2.067171 4.56317 -0.4072
H  -4.927915 3.638812 -0.964361
H  -4.381327 4.531118 0.441329
H  -1.475114 3.458243 -2.558659
H  -3.134219 2.92199 -2.75634
H  2.989536 -2.273877 -0.344516
H  2.120123 0.46069 -1.936733
H  2.779114 -0.092167 2.253059
H  2.630314 -4.65341 -0.784963
H  0.37004 -5.638217 -0.712794
H  4.295265 1.608534 -2.129048
H  4.927725 1.056663 2.088473
H  7.106922 1.439503 1.353674
H  6.225023 2.961741 1.624718
H  7.590657 2.912606 0.498606
H  -4.300785 1.3526 1.775096
elementType: Cl O N C H
totalener: -1794.57354341 hartree
nucrepener: 3028.32148021 hartree
electener: -4822.89502362 hartree
oneelecener: -8478.36686957 hartree
twoeener: 3655.47184594 hartree
cpcmener: -0.04424481 hartree
kineticenergy: 1788.45125686 hartree
xcener: -147.625995387645 hartree
chargesum: -0.0000000
charge: -0.064490 -0.301785 -0.470950 -0.426847 -0.474039 -0.320996 0.077341 -0.257857 -0.293616 -0.134012 -0.084868 -0.106084 0.320679 0.329109 0.296718 0.150109 0.286138 0.143187 0.095353 0.027170 -0.170883 -0.004585 -0.208407 -0.235030 -0.129708 -0.150475 -0.152787 -0.141584 0.309526 -0.122173 0.082545 0.087356 0.111227 0.100367 0.088543 0.102727 0.155557 0.145749 0.147135 0.160876 0.138176 0.138867 0.142004 0.111879 0.113371 0.123347 0.266121
qa: -0.0645 -0.3018 -0.4709 -0.4268 -0.4740 -0.3210 0.0773 -0.2579 -0.2936 -0.1340 -0.0849 -0.1061 0.3207 0.3291 0.2967 0.1501 0.2861 0.1432 0.0954 0.0272 -0.1709 -0.0046 -0.2084 -0.2350 -0.1297 -0.1505 -0.1528 -0.1416 0.3095 -0.1222 0.0825 0.0874 0.1112 0.1004 0.0885 0.1027 0.1556 0.1457 0.1471 0.1609 0.1382 0.1389 0.1420 0.1119 0.1134 0.1233 0.2661
va: 1.2555 2.2662 2.0145 2.0886 2.0471 2.0826 3.1645 3.0960 3.4677 3.9273 3.9389 3.9220 3.8789 3.9051 3.9264 3.9005 4.1674 3.8672 3.9337 3.5305 3.8793 3.9104 4.1025 4.1074 3.9424 3.9904 3.9455 3.7830 3.8100 3.8624 1.0128 1.0093 1.0072 1.0205 1.0274 1.0067 1.0018 1.0142 1.0130 0.9886 1.0090 1.0119 1.0124 0.9861 0.9875 0.9940 1.0586
dispcorr: -0.025053234 hartree
energy: -1794.598596645528
dipole: 19.01888 -17.23626 1.78263 27.68594 -26.30742 1.37852 -3.57236 3.14918 -0.42319
magnitude: 2.29285 au
magnitude: 5.82797 debye
