program: Orca
programVersion: 5.0.2
elementType: Cl O O O O O N N C C C C C C C C C C C C C C C C C C C C C C H H H H H H H H H H H H H H H H H
charge: 0
multiplicity: 1
keywords: wb97x-d3
keywords: def2-TZVPP
keywords: def2/J RIJCOSX
keywords: DEFGRID2
keywords: scfconv7
keywords: smallprint printgap noloewdin
keywords: NOSOSCF
formula: C22H17ClN2O5
InChI: InChI=1/C22H17ClN2O5/c1-30-13-10-8-12(9-11-13)25-15-5-2-4-14(23)19(15)24-20(22(25)29)21(28)18-16(26)6-3-7-17(18)27/h2,4-5,8-11,26H,3,6-7H2,1H3
47 atoms
Cl -2.195357 -4.387655 -0.280017
O  -4.516149 2.259884 1.481032
O  -1.210638 1.081806 -1.624833
O  -3.174776 0.212233 1.855313
O  0.149654 1.399839 1.10081
O  5.953229 2.028605 -0.204481
N  1.055487 -0.519543 0.269599
N  -1.504769 -1.599405 0.289117
C  -2.780583 1.633003 0.02944
C  -2.928394 4.22098 -1.135867
C  -4.109947 3.747168 -0.304385
C  -2.413103 3.09263 -2.013339
C  -3.787017 2.490746 0.432957
C  -2.046783 1.86125 -1.214746
C  -2.488446 0.492639 0.875402
C  -1.306496 -0.374026 0.566009
C  0.008953 0.275896 0.678857
C  0.879061 -1.844446 -0.090749
C  -0.422252 -2.375258 -0.032747
C  2.335246 0.101184 0.175465
C  1.94718 -2.647711 -0.489557
C  -0.613783 -3.726428 -0.354098
C  2.655369 0.816918 -0.970847
C  3.237338 0.022578 1.216875
C  1.7175 -3.971761 -0.801643
C  0.443908 -4.526151 -0.730828
C  3.877485 1.446228 -1.07144
C  4.472135 0.650118 1.123946
C  4.795393 1.372129 -0.021647
C  6.909498 2.011102 0.824345
H  -3.22179 5.075157 -1.746995
H  -2.130975 4.566426 -0.473497
H  -4.975785 3.550065 -0.947394
H  -4.430092 4.50268 0.415367
H  -1.541933 3.394674 -2.595054
H  -3.18415 2.798608 -2.735402
H  2.945317 -2.239629 -0.551325
H  1.933161 0.888163 -1.774154
H  2.979282 -0.525849 2.113431
H  2.547785 -4.593729 -1.107511
H  0.278334 -5.565605 -0.973967
H  4.134153 2.011618 -1.957347
H  5.156599 0.575485 1.957323
H  7.263361 0.998817 1.043682
H  6.529808 2.458005 1.748256
H  7.751897 2.602888 0.474125
H  -4.196598 1.387405 1.873352
totalener: -1794.54052685 hartree
nucrepener: 3031.71342880 hartree
electener: -4826.25395565 hartree
oneelecener: -8483.64989399 hartree
twoeener: 3657.39593834 hartree
kineticenergy: 1788.51864293 hartree
xcener: -147.629880815473 hartree
chargesum: -0.0000000
charge: -0.040929 -0.281937 -0.391221 -0.357303 -0.368204 -0.281684 0.041740 -0.222107 -0.275463 -0.145327 -0.105137 -0.129244 0.271744 0.318112 0.267810 0.147639 0.239975 0.117338 0.087745 0.027420 -0.156896 -0.006918 -0.158027 -0.214353 -0.104450 -0.139180 -0.118052 -0.120442 0.285925 -0.135495 0.077994 0.089603 0.094810 0.098359 0.090915 0.088101 0.134855 0.123599 0.119792 0.127057 0.113547 0.120172 0.109284 0.098888 0.102529 0.117125 0.240291
qa: -0.0409 -0.2819 -0.3912 -0.3573 -0.3682 -0.2817 0.0417 -0.2221 -0.2755 -0.1453 -0.1051 -0.1292 0.2717 0.3181 0.2678 0.1476 0.2400 0.1173 0.0877 0.0274 -0.1569 -0.0069 -0.1580 -0.2144 -0.1045 -0.1392 -0.1181 -0.1204 0.2859 -0.1355 0.0780 0.0896 0.0948 0.0984 0.0909 0.0881 0.1349 0.1236 0.1198 0.1271 0.1135 0.1202 0.1093 0.0989 0.1025 0.1171 0.2403
va: 1.2808 2.2834 2.0903 2.1679 2.1543 2.1177 3.1275 3.1037 3.5143 3.9193 3.9259 3.9003 3.9018 3.9141 3.9694 3.8597 4.2205 3.9236 3.9310 3.6588 3.9317 3.9761 4.1164 4.1712 3.9757 4.0204 3.9550 3.8203 3.8853 3.8996 1.0135 1.0086 1.0096 1.0235 1.0295 1.0099 1.0118 1.0276 1.0205 0.9999 1.0202 1.0170 1.0209 0.9863 0.9865 0.9978 1.1011
dispcorr: -0.025201622 hartree
energy: -1794.565728473511
dipole: 19.16172 -17.81877 1.34294 26.31186 -25.22543 1.08643 -4.30920 3.76248 -0.54672
magnitude: 1.81183 au
magnitude: 4.60531 debye
