program: Orca
programVersion: 5.0.2
elementType: Cl O O O O O N N C C C C C C C C C C C C C C C C C C C C C C H H H H H H H H H H H H H H H H H
charge: 0
multiplicity: 1
keywords: wb97x-d3
keywords: def2-TZVPP
keywords: def2/J RIJCOSX
keywords: DEFGRID2
keywords: scfconv7
keywords: smallprint printgap noloewdin
keywords: NOSOSCF
formula: C22H17ClN2O5
InChI: InChI=1/C22H17ClN2O5/c1-30-13-10-8-12(9-11-13)25-15-5-2-4-14(23)19(15)24-20(22(25)29)21(28)18-16(26)6-3-7-17(18)27/h2,4-5,8-11,28H,3,6-7H2,1H3
47 atoms
Cl -2.168307 -4.244567 -0.51479
O  -4.644555 2.036556 1.487691
O  -1.131228 1.284553 -1.519816
O  -3.100705 0.189356 1.913996
O  0.200342 1.436394 1.234233
O  6.183961 1.766918 0.487237
N  1.10794 -0.455207 0.342806
N  -1.460467 -1.500918 0.221152
C  -2.832077 1.617783 0.070413
C  -3.24253 4.190347 -1.060824
C  -4.413656 3.563845 -0.318834
C  -2.541018 3.153194 -1.924298
C  -3.994374 2.36788 0.488854
C  -2.073041 1.949132 -1.13696
C  -2.447868 0.549306 0.864955
C  -1.258937 -0.292457 0.562989
C  0.058608 0.339307 0.751737
C  0.928501 -1.756764 -0.093122
C  -0.378999 -2.273368 -0.108181
C  2.410381 0.124723 0.365337
C  1.999777 -2.553293 -0.49779
C  -0.577216 -3.603431 -0.505095
C  2.822413 0.912255 -0.691402
C  3.257116 -0.092001 1.443587
C  1.764207 -3.855388 -0.887641
C  0.482623 -4.396049 -0.889355
C  4.087232 1.482724 -0.687533
C  4.517749 0.466994 1.454804
C  4.943115 1.261775 0.388314
C  6.655027 2.606939 -0.535499
H  -3.593605 5.017755 -1.678595
H  -2.535749 4.615451 -0.343692
H  -5.170941 3.224655 -1.035934
H  -4.911881 4.272424 0.343661
H  -1.681644 3.573031 -2.447687
H  -3.227655 2.789598 -2.6984
H  3.004917 -2.158346 -0.504461
H  2.148636 1.090268 -1.519629
H  2.92529 -0.699656 2.275365
H  2.597121 -4.471285 -1.19855
H  0.314475 -5.419064 -1.192713
H  4.381386 2.097897 -1.526186
H  5.184078 0.305769 2.291619
H  6.711672 2.092769 -1.500021
H  7.658124 2.912658 -0.24766
H  6.037658 3.503037 -0.651191
H  -3.889826 0.83552 1.988164
totalener: -1794.53860052 hartree
nucrepener: 3026.57582291 hartree
electener: -4821.11442343 hartree
oneelecener: -8473.07810473 hartree
twoeener: 3651.96368130 hartree
kineticenergy: 1788.51223689 hartree
xcener: -147.628983711263 hartree
chargesum: 0.0000000
charge: -0.039855 -0.385765 -0.394637 -0.260022 -0.360115 -0.281457 0.038323 -0.226091 -0.318512 -0.139721 -0.121568 -0.129208 0.273517 0.325896 0.328354 0.129292 0.255790 0.117037 0.084172 0.028594 -0.157619 -0.006699 -0.190670 -0.184073 -0.102108 -0.138985 -0.123629 -0.112687 0.284662 -0.134815 0.076806 0.086029 0.090477 0.096203 0.090293 0.087743 0.135510 0.125689 0.119959 0.128207 0.114814 0.109912 0.120522 0.098692 0.117048 0.103136 0.241563
qa: -0.0399 -0.3858 -0.3946 -0.2600 -0.3601 -0.2815 0.0383 -0.2261 -0.3185 -0.1397 -0.1216 -0.1292 0.2735 0.3259 0.3284 0.1293 0.2558 0.1170 0.0842 0.0286 -0.1576 -0.0067 -0.1907 -0.1841 -0.1021 -0.1390 -0.1236 -0.1127 0.2847 -0.1348 0.0768 0.0860 0.0905 0.0962 0.0903 0.0877 0.1355 0.1257 0.1200 0.1282 0.1148 0.1099 0.1205 0.0987 0.1170 0.1031 0.2416
va: 1.2819 2.1439 2.0911 2.3153 2.1662 2.1186 3.1358 3.0884 3.5342 3.8919 3.9148 3.9063 3.9608 3.9082 3.9208 3.8751 4.2181 3.9311 3.9326 3.6612 3.9338 3.9807 4.1525 4.1360 3.9759 4.0207 3.8108 3.9603 3.8880 3.8993 1.0128 1.0085 1.0104 1.0281 1.0295 1.0101 1.0121 1.0292 1.0154 0.9995 1.0197 1.0214 1.0165 0.9862 0.9980 0.9866 1.1043
dispcorr: -0.025001009 hartree
energy: -1794.563601526785
dipole: 17.26632 -15.86932 1.39701 27.13109 -26.24724 0.88385 -8.37817 7.07933 -1.29884
magnitude: 2.10233 au
magnitude: 5.34371 debye
