program: Orca
programVersion: 5.0.2
elementType: F F F O O O O O N C C C C C C C C C C C C C C C C C C C H H H H H H H H H H H H H H H H H H H H
charge: 0
multiplicity: 1
keywords: wb97x-d3
keywords: def2-TZVPP
keywords: def2/J RIJCOSX
keywords: DEFGRID2
keywords: scfconv7
keywords: smallprint printgap noloewdin
keywords: NOSOSCF
formula: C19H20F3NO5
InChI: InChI=1/C19H20F3NO5/c1-27-6-7-28-9-13-12(4-5-14(23-13)19(20,21)22)18(26)15-16(24)10-2-3-11(8-10)17(15)25/h4-5,10-11,26H,2-3,6-9H2,1H3
48 atoms
F  4.561707 2.423966 -1.218171
F  5.031194 2.705186 0.863572
F  5.471756 0.832465 -0.102069
O  -0.96867 2.205153 -0.277247
O  -2.962506 -1.426986 1.914543
O  -0.514047 -1.282001 1.968368
O  -0.271564 -1.314503 -1.426072
O  -1.610282 -3.42995 -0.162768
N  2.534638 0.756788 -0.655906
C  -3.249518 1.673414 -0.732742
C  -4.272221 -0.121523 0.407084
C  -4.358019 1.395777 0.279637
C  -3.484269 0.585426 -1.805825
C  -4.153934 -0.587645 -1.063924
C  -1.904928 1.442824 -0.091996
C  -2.99816 -0.490285 1.100555
C  -1.79973 0.243932 0.742502
C  -0.583373 -0.261128 1.167848
C  0.752296 0.286858 0.837149
C  1.328565 0.258886 -0.438612
C  1.498229 0.801591 1.886541
C  0.640092 -0.280384 -1.66666
C  2.754845 1.332305 1.644627
C  3.213542 1.295237 0.3440
C  4.5734 1.823305 -0.029089
C  0.319972 -2.590329 -1.277439
C  -0.76774 -3.631068 -1.272255
C  -2.662203 -4.363545 -0.108882
H  -3.276769 2.680941 -1.146681
H  -5.11449 -0.576212 0.927719
H  -4.229184 1.92184 1.227452
H  -5.326626 1.682889 -0.133069
H  -4.145183 0.985888 -2.574126
H  -2.561789 0.290394 -2.307195
H  -3.593158 -1.518582 -1.158458
H  -5.153529 -0.77946 -1.452909
H  1.094665 0.816986 2.890566
H  0.08493 0.536595 -2.136302
H  1.41306 -0.584412 -2.381273
H  3.33639 1.749579 2.453796
H  0.914576 -2.649754 -0.357081
H  0.994549 -2.804308 -2.11507
H  -1.338632 -3.580421 -2.209797
H  -0.295279 -4.621705 -1.237648
H  -3.275718 -4.131444 0.760652
H  -3.29724 -4.3209 -1.001003
H  -2.291514 -5.390113 -0.006892
H  -1.471006 -1.563526 2.170754
elementType: F O N C H
totalener: -1466.65531282 hartree
nucrepener: 2903.23129935 hartree
electener: -4369.88661217 hartree
oneelecener: -7786.56309901 hartree
twoeener: 3416.67648684 hartree
cpcmener: -0.04367775 hartree
kineticenergy: 1460.84387833 hartree
xcener: -133.542035148817 hartree
chargesum: 0.0000000
charge: -0.172404 -0.177100 -0.177815 -0.482630 -0.468668 -0.329071 -0.377054 -0.383462 -0.351347 0.251050 0.227257 -0.266102 -0.235448 -0.202674 0.165293 0.156361 -0.228346 0.406596 0.022514 0.104193 -0.104323 0.030004 -0.151529 0.119116 0.495122 0.007953 0.006667 -0.120490 0.069426 0.073032 0.098678 0.097574 0.102522 0.093905 0.081366 0.103381 0.157277 0.119847 0.113603 0.154091 0.097151 0.107886 0.087364 0.094656 0.104515 0.097053 0.110940 0.272070
qa: -0.1724 -0.1771 -0.1778 -0.4826 -0.4687 -0.3291 -0.3771 -0.3835 -0.3513 0.2511 0.2273 -0.2661 -0.2354 -0.2027 0.1653 0.1564 -0.2283 0.4066 0.0225 0.1042 -0.1043 0.0300 -0.1515 0.1191 0.4951 0.0080 0.0067 -0.1205 0.0694 0.0730 0.0987 0.0976 0.1025 0.0939 0.0814 0.1034 0.1573 0.1198 0.1136 0.1541 0.0972 0.1079 0.0874 0.0947 0.1045 0.0971 0.1109 0.2721
va: 1.1310 1.1256 1.1163 1.9931 2.0353 2.2102 1.9121 1.9088 3.0989 3.6256 3.7188 4.0630 3.9422 3.9408 4.0132 4.0034 3.3315 3.7097 3.5311 3.8324 4.0053 3.8429 3.9657 3.8722 4.5132 3.8849 3.9471 3.8864 1.0260 1.0258 1.0116 1.0070 1.0075 1.0215 1.0243 1.0066 1.0043 0.9957 1.0188 1.0049 1.0008 1.0025 0.9992 0.9988 0.9998 0.9865 0.9952 1.0666
dispcorr: -0.029410699 hartree
energy: -1466.684723521479
dipole: -49.27476 47.03071 -2.24405 -26.24690 24.85554 -1.39136 -8.87734 8.76446 -0.11288
magnitude: 2.64280 au
magnitude: 6.71745 debye
