program: Orca
programVersion: 5.0.2
elementType: F F F O O O O O N C C C C C C C C C C C C C C C C C C C H H H H H H H H H H H H H H H H H H H H
charge: 0
multiplicity: 1
keywords: wb97x-d3
keywords: def2-TZVPP
keywords: def2/J RIJCOSX
keywords: DEFGRID2
keywords: scfconv7
keywords: smallprint printgap noloewdin
keywords: NOSOSCF
formula: C19H20F3NO5
InChI: InChI=1/C19H20F3NO5/c1-27-6-7-28-9-13-12(4-5-14(23-13)19(20,21)22)18(26)15-16(24)10-2-3-11(8-10)17(15)25/h4-5,10-11,24H,2-3,6-9H2,1H3
48 atoms
F  -4.593122 -2.553753 -1.089431
F  -5.004132 -2.881667 0.998411
F  -5.47988 -0.992767 0.086493
O  0.867007 -1.998265 -0.7103
O  3.045148 1.322054 1.814422
O  0.594981 1.083652 2.071497
O  -0.203558 1.762459 -0.823152
O  0.601391 4.450046 -0.534451
N  -2.681628 -0.66558 -0.476158
C  3.207907 -1.644812 -0.987599
C  4.288072 -0.017565 0.312247
C  4.284466 -1.525927 0.086867
C  3.590471 -0.519073 -1.977439
C  4.319235 0.541443 -1.130162
C  1.852263 -1.350348 -0.38842
C  2.993154 0.367502 0.937751
C  1.79845 -0.248582 0.571027
C  0.579082 0.212588 1.189775
C  -0.752219 -0.396964 0.884252
C  -1.482367 -0.146696 -0.283762
C  -1.328991 -1.187356 1.861902
C  -0.938598 0.708751 -1.388663
C  -2.582875 -1.742643 1.648454
C  -3.20674 -1.451496 0.45401
C  -4.574319 -1.977755 0.11545
C  0.664702 2.395795 -1.738465
C  1.464524 3.445615 -1.016149
C  1.285951 5.423483 0.218651
H  3.171709 -2.622561 -1.467241
H  5.114075 0.345766 0.922998
H  4.071972 -2.100079 0.990083
H  5.25137 -1.850893 -0.300596
H  4.25647 -0.930449 -2.735577
H  2.725129 -0.115432 -2.50453
H  3.866584 1.530831 -1.204255
H  5.359882 0.643461 -1.437125
H  -0.801714 -1.390235 2.785167
H  -0.305315 0.090503 -2.040357
H  -1.765265 1.075891 -2.006863
H  -3.036875 -2.368095 2.403106
H  0.097331 2.845316 -2.563885
H  1.359399 1.67144 -2.18265
H  2.02731 2.987544 -0.191526
H  2.203199 3.857627 -1.716573
H  1.772082 4.991295 1.101042
H  2.053377 5.937092 -0.371943
H  0.559459 6.1628 0.554349
H  2.102675 1.480266 2.136143
elementType: F O N C H
totalener: -1466.65851932 hartree
nucrepener: 2862.29070977 hartree
electener: -4328.94922909 hartree
oneelecener: -7703.63136823 hartree
twoeener: 3374.68213915 hartree
cpcmener: -0.05399839 hartree
kineticenergy: 1460.83243756 hartree
xcener: -133.539984100745 hartree
chargesum: -0.0000000
charge: -0.176022 -0.177504 -0.177888 -0.494789 -0.316662 -0.464975 -0.358748 -0.397714 -0.348856 0.240683 0.255855 -0.271189 -0.245999 -0.231094 0.213429 0.153581 -0.246571 0.416912 0.025117 0.129482 -0.130542 -0.051362 -0.133950 0.109991 0.495589 0.017670 0.017030 -0.110729 0.070968 0.084520 0.099464 0.099050 0.106088 0.107409 0.097424 0.105417 0.154851 0.113904 0.107181 0.153571 0.107890 0.091339 0.078456 0.099313 0.093089 0.092906 0.118587 0.277830
qa: -0.1760 -0.1775 -0.1779 -0.4948 -0.3167 -0.4650 -0.3587 -0.3977 -0.3489 0.2407 0.2559 -0.2712 -0.2460 -0.2311 0.2134 0.1536 -0.2466 0.4169 0.0251 0.1295 -0.1305 -0.0514 -0.1340 0.1100 0.4956 0.0177 0.0170 -0.1107 0.0710 0.0845 0.0995 0.0990 0.1061 0.1074 0.0974 0.1054 0.1549 0.1139 0.1072 0.1536 0.1079 0.0913 0.0785 0.0993 0.0931 0.0929 0.1186 0.2778
va: 1.1251 1.1254 1.1192 1.9883 2.2382 2.0303 1.9499 1.9085 3.1161 3.6508 3.6988 4.0774 3.9439 3.9473 3.9622 3.9469 3.3570 3.7428 3.5980 3.9340 4.0309 4.0259 3.9256 3.8679 4.5129 3.8856 3.9485 3.8998 1.0266 1.0192 1.0125 1.0071 1.0061 1.0026 1.0184 1.0076 1.0038 0.9924 1.0186 1.0042 1.0066 0.9987 0.9956 0.9974 0.9917 0.9888 0.9914 1.0511
dispcorr: -0.028135979 hartree
energy: -1466.686655298237
dipole: 52.41246 -47.51427 4.89819 26.61437 -26.27116 0.34321 -9.38918 9.35950 -0.02968
magnitude: 4.91029 au
magnitude: 12.48096 debye
