program: Orca
programVersion: 5.0.2
elementType: F F F O O O O O N C C C C C C C C C C C C C C C C C C C H H H H H H H H H H H H H H H H H H H H
charge: 0
multiplicity: 1
keywords: wb97x-d3
keywords: def2-TZVPP
keywords: def2/J RIJCOSX
keywords: DEFGRID2
keywords: scfconv7
keywords: smallprint printgap noloewdin
keywords: NOSOSCF
formula: C19H20F3NO5
InChI: InChI=1/C19H20F3NO5/c1-27-6-7-28-9-13-12(4-5-14(23-13)19(20,21)22)18(26)15-16(24)10-2-3-11(8-10)17(15)25/h4-5,10-11,24H,2-3,6-9H2,1H3
48 atoms
F  -5.023564 -1.967498 -0.961963
F  -4.773478 -3.182626 0.794621
F  -5.522325 -1.17253 0.969798
O  0.759517 -1.473053 -1.136609
O  2.962772 1.32932 1.927056
O  0.453643 1.356186 1.868355
O  -0.180671 1.678519 -1.116845
O  1.719858 3.580389 -0.239104
N  -2.960512 -0.366944 -0.276872
C  3.13123 -1.578259 -0.93929
C  4.217097 -0.164675 0.583328
C  4.036969 -1.649238 0.283977
C  3.81333 -0.493885 -1.807078
C  4.545104 0.422466 -0.809937
C  1.75818 -1.087356 -0.546606
C  2.909447 0.381199 1.03938
C  1.711604 -0.09271 0.521861
C  0.473833 0.438022 1.041085
C  -0.825281 -0.243262 0.751781
C  -1.777335 0.213783 -0.159012
C  -1.135349 -1.348923 1.527283
C  -1.546199 1.382333 -1.069199
C  -2.371086 -1.958703 1.396137
C  -3.247966 -1.412283 0.480055
C  -4.643791 -1.94365 0.315036
C  0.111549 2.85899 -1.83438
C  1.542788 3.259109 -1.599339
C  2.962128 4.18987 0.018919
H  3.026334 -2.524362 -1.469386
H  4.985197 0.059192 1.322835
H  3.609818 -2.210261 1.116213
H  4.996413 -2.100266 0.026974
H  4.521011 -0.97496 -2.481653
H  3.100121 0.048252 -2.429552
H  4.251027 1.467507 -0.901056
H  5.623889 0.380924 -0.955154
H  -0.415147 -1.737343 2.236307
H  -1.942587 1.14244 -2.063645
H  -2.125465 2.240276 -0.698997
H  -2.622444 -2.819263 1.998906
H  -0.555423 3.67273 -1.522821
H  -0.04044 2.706937 -2.909111
H  2.228937 2.458687 -1.909768
H  1.753371 4.12452 -2.241317
H  3.019098 4.402144 1.085252
H  3.807146 3.548398 -0.251583
H  3.07126 5.134867 -0.525396
H  2.023756 1.622475 2.114722
elementType: F O N C H
totalener: -1466.65775492 hartree
nucrepener: 2884.04470686 hartree
electener: -4350.70246178 hartree
oneelecener: -7748.58792264 hartree
twoeener: 3397.88546086 hartree
cpcmener: -0.05260374 hartree
kineticenergy: 1460.88197606 hartree
xcener: -133.550424806669 hartree
chargesum: -0.0000000
charge: -0.173806 -0.177838 -0.178853 -0.501939 -0.317420 -0.467319 -0.343679 -0.389815 -0.366794 0.228173 0.251317 -0.263321 -0.231714 -0.237778 0.225946 0.172900 -0.319892 0.449911 0.077683 0.119268 -0.162122 -0.016602 -0.118469 0.097866 0.495057 0.014120 0.012816 -0.133052 0.073911 0.085713 0.097502 0.097860 0.105109 0.096755 0.105849 0.104622 0.154360 0.099407 0.113237 0.152177 0.085171 0.091051 0.083829 0.106611 0.118312 0.095416 0.110613 0.277850
qa: -0.1738 -0.1778 -0.1789 -0.5019 -0.3174 -0.4673 -0.3437 -0.3898 -0.3668 0.2282 0.2513 -0.2633 -0.2317 -0.2378 0.2259 0.1729 -0.3199 0.4499 0.0777 0.1193 -0.1621 -0.0166 -0.1185 0.0979 0.4951 0.0141 0.0128 -0.1331 0.0739 0.0857 0.0975 0.0979 0.1051 0.0968 0.1058 0.1046 0.1544 0.0994 0.1132 0.1522 0.0852 0.0911 0.0838 0.1066 0.1183 0.0954 0.1106 0.2779
va: 1.1291 1.1246 1.1142 1.9774 2.2447 2.0192 1.9853 1.8925 3.0858 3.6797 3.6885 4.0711 3.9375 3.9588 3.9675 3.9483 3.4338 3.7679 3.6329 3.9532 4.0364 4.0190 3.9241 3.8906 4.5096 3.9334 3.9316 3.8961 1.0267 1.0189 1.0145 1.0069 1.0055 1.0131 1.0043 1.0089 1.0002 1.0026 0.9954 1.0041 1.0028 0.9960 0.9916 1.0035 0.9910 0.9790 0.9955 1.0454
dispcorr: -0.028547478 hartree
energy: -1466.686302397775
dipole: 54.37405 -50.04105 4.33301 24.78868 -24.17392 0.61476 -11.01963 10.83433 -0.18530
magnitude: 4.38032 au
magnitude: 11.13390 debye
