program: Orca
programVersion: 5.0.2
elementType: F F F O O O O O N C C C C C C C C C C C C C C C C C C C H H H H H H H H H H H H H H H H H H H H
charge: 0
multiplicity: 1
keywords: wb97x-d3
keywords: def2-TZVPP
keywords: def2/J RIJCOSX
keywords: DEFGRID2
keywords: scfconv7
keywords: smallprint printgap noloewdin
keywords: NOSOSCF
formula: C19H20F3NO5
InChI: InChI=1/C19H20F3NO5/c1-27-6-7-28-9-13-12(4-5-14(23-13)19(20,21)22)18(26)15-16(24)10-2-3-11(8-10)17(15)25/h4-5,10-11,26H,2-3,6-9H2,1H3
48 atoms
F  5.043588 2.734217 1.040577
F  5.460153 0.808795 0.17913
F  4.666571 2.381945 -1.048461
O  -0.975854 2.17805 -0.45022
O  -2.994845 -1.39214 1.834468
O  -0.57809 -1.103648 2.07933
O  -0.174857 -1.457757 -1.133629
O  -1.628062 -3.813514 -1.475825
N  2.606879 0.687956 -0.481429
C  -3.248626 1.622594 -0.917485
C  -4.271677 -0.164413 0.235017
C  -4.387737 1.346751 0.060672
C  -3.421717 0.502164 -1.969168
C  -4.077943 -0.671283 -1.215227
C  -1.920042 1.433841 -0.230698
C  -3.02165 -0.473047 0.998262
C  -1.835182 0.294472 0.682878
C  -0.631414 -0.1405 1.210268
C  0.706934 0.420522 0.914346
C  1.384214 0.220465 -0.295317
C  1.354893 1.10149 1.931359
C  0.766629 -0.480058 -1.47918
C  2.628887 1.603854 1.719667
C  3.202074 1.36722 0.487778
C  4.596529 1.831447 0.164546
C  0.385643 -2.716327 -0.812564
C  -0.720259 -3.656516 -0.409154
C  -2.744256 -4.591175 -1.1098
H  -3.281175 2.617871 -1.359981
H  -5.124872 -0.625467 0.732251
H  -4.304529 1.900087 0.998155
H  -5.346974 1.600719 -0.393631
H  -4.072235 0.864414 -2.764866
H  -2.476567 0.221947 -2.436248
H  -3.478497 -1.582041 -1.26128
H  -5.053967 -0.912569 -1.635736
H  0.864231 1.261929 2.882536
H  0.248587 0.267818 -2.087214
H  1.569635 -0.88996 -2.10156
H  3.139023 2.147763 2.500933
H  1.094952 -2.643348 0.020626
H  0.936763 -3.115269 -1.673607
H  -0.265781 -4.615946 -0.127822
H  -1.235712 -3.27498 0.481617
H  -3.415606 -4.643275 -1.965936
H  -2.459377 -5.612291 -0.831441
H  -3.290489 -4.151173 -0.267124
H  -1.536846 -1.426432 2.214827
elementType: F O N C H
totalener: -1466.65596724 hartree
nucrepener: 2885.22106945 hartree
electener: -4351.87703668 hartree
oneelecener: -7749.47722148 hartree
twoeener: 3397.60018480 hartree
cpcmener: -0.04410555 hartree
kineticenergy: 1460.83315137 hartree
xcener: -133.540036409161 hartree
chargesum: 0.0000000
charge: -0.177249 -0.177331 -0.174067 -0.488592 -0.471093 -0.325839 -0.372243 -0.400185 -0.349019 0.241977 0.227996 -0.267448 -0.225253 -0.204242 0.171402 0.174882 -0.211230 0.383908 0.017171 0.095758 -0.111673 0.044508 -0.139197 0.113301 0.494433 0.005398 -0.008204 -0.117915 0.070834 0.072975 0.098225 0.097309 0.101481 0.093966 0.070349 0.104124 0.157681 0.119273 0.115382 0.152750 0.100984 0.103969 0.107076 0.084980 0.122552 0.110047 0.089625 0.276466
qa: -0.1772 -0.1773 -0.1741 -0.4886 -0.4711 -0.3258 -0.3722 -0.4002 -0.3490 0.2420 0.2280 -0.2674 -0.2253 -0.2042 0.1714 0.1749 -0.2112 0.3839 0.0172 0.0958 -0.1117 0.0445 -0.1392 0.1133 0.4944 0.0054 -0.0082 -0.1179 0.0708 0.0730 0.0982 0.0973 0.1015 0.0940 0.0703 0.1041 0.1577 0.1193 0.1154 0.1527 0.1010 0.1040 0.1071 0.0850 0.1226 0.1100 0.0896 0.2765
va: 1.1258 1.1185 1.1287 1.9874 2.0389 2.2167 1.9195 1.8816 3.1057 3.6442 3.7364 4.0673 3.9398 3.9488 4.0075 3.9841 3.3421 3.7331 3.5549 3.8729 4.0166 3.8386 3.9457 3.8788 4.5153 3.9044 3.9326 3.8706 1.0256 1.0263 1.0116 1.0067 1.0069 1.0178 1.0365 1.0065 1.0031 0.9956 1.0167 1.0051 0.9957 1.0043 1.0026 1.0064 0.9902 0.9935 0.9939 1.0601
dispcorr: -0.029049478 hartree
energy: -1466.685016713265
dipole: -49.39098 47.03050 -2.36048 -26.62783 25.62763 -1.00020 -8.68809 9.76822 1.08013
magnitude: 2.78190 au
magnitude: 7.07103 debye
