program: Orca
programVersion: 5.0.2
elementType: F F F O O O O O N C C C C C C C C C C C C C C C C C C C H H H H H H H H H H H H H H H H H H H H
charge: 0
multiplicity: 1
keywords: wb97x-d3
keywords: def2-TZVPP
keywords: def2/J RIJCOSX
keywords: DEFGRID2
keywords: scfconv7
keywords: smallprint printgap noloewdin
keywords: NOSOSCF
formula: C19H20F3NO5
InChI: InChI=1/C19H20F3NO5/c1-27-6-7-28-9-13-12(4-5-14(23-13)19(20,21)22)18(26)15-16(24)10-2-3-11(8-10)17(15)25/h4-5,10-11,24H,2-3,6-9H2,1H3
48 atoms
F  -4.479838 -3.116691 0.715276
F  -5.108719 -1.060494 0.646348
F  -5.098571 -2.242001 -1.14802
O  0.725344 -0.611944 1.697096
O  3.41688 0.370286 -2.041404
O  0.99119 0.076791 -2.416959
O  -0.407339 2.236892 -0.751024
O  0.749135 4.522404 0.514882
N  -2.857307 -0.302419 -0.618269
C  3.092143 -0.526956 1.925146
C  4.415031 0.060566 0.079479
C  4.036666 0.577669 1.462313
C  3.843703 -1.821283 1.530481
C  4.760733 -1.420866 0.358989
C  1.802189 -0.445716 1.144892
C  3.208346 0.09651 -0.791918
C  1.938079 -0.18857 -0.290734
C  0.835744 -0.209365 -1.220242
C  -0.52075 -0.680513 -0.819147
C  -1.642482 0.148355 -0.893911
C  -0.699332 -2.012422 -0.486711
C  -1.53274 1.598262 -1.296723
C  -1.973333 -2.482913 -0.219428
C  -3.012528 -1.575453 -0.290514
C  -4.430051 -1.998439 -0.013349
C  -0.541887 2.52237 0.629471
C  0.684347 3.247633 1.112543
C  1.886496 5.246342 0.922507
H  2.858704 -0.489256 2.988693
H  5.231078 0.601694 -0.398282
H  3.578385 1.568302 1.44649
H  4.919444 0.624425 2.101816
H  4.429502 -2.16737 2.381516
H  3.16054 -2.630112 1.268933
H  4.633808 -2.053824 -0.519056
H  5.810687 -1.477659 0.645743
H  0.146939 -2.685469 -0.436583
H  -1.44267 1.664658 -2.38402
H  -2.460825 2.110081 -1.01887
H  -2.128642 -3.519623 0.04111
H  -0.655862 1.607377 1.219895
H  -1.437813 3.131643 0.806766
H  0.623529 3.327991 2.206209
H  1.586896 2.660796 0.88674
H  2.818397 4.742651 0.639542
H  1.860584 6.219916 0.43353
H  1.905668 5.405497 2.007052
H  2.524055 0.332647 -2.508403
elementType: F O N C H
totalener: -1466.65846734 hartree
nucrepener: 2848.48032612 hartree
electener: -4315.13879346 hartree
oneelecener: -7675.85300171 hartree
twoeener: 3360.71420826 hartree
cpcmener: -0.04935371 hartree
kineticenergy: 1460.83767269 hartree
xcener: -133.540398885088 hartree
chargesum: 0.0000000
charge: -0.178028 -0.172830 -0.178570 -0.491139 -0.310743 -0.459654 -0.377704 -0.394885 -0.347146 0.265982 0.219922 -0.284285 -0.219624 -0.213826 0.166040 0.228884 -0.278169 0.359614 0.035281 0.092430 -0.145584 0.034609 -0.118101 0.107077 0.494149 -0.005687 0.051464 -0.110583 0.068691 0.083417 0.104835 0.102342 0.100134 0.094163 0.098789 0.100252 0.164221 0.123504 0.103643 0.151794 0.100767 0.104757 0.088116 0.062895 0.094017 0.118771 0.092870 0.273132
qa: -0.1780 -0.1728 -0.1786 -0.4911 -0.3107 -0.4597 -0.3777 -0.3949 -0.3471 0.2660 0.2199 -0.2843 -0.2196 -0.2138 0.1660 0.2289 -0.2782 0.3596 0.0353 0.0924 -0.1456 0.0346 -0.1181 0.1071 0.4941 -0.0057 0.0515 -0.1106 0.0687 0.0834 0.1048 0.1023 0.1001 0.0942 0.0988 0.1003 0.1642 0.1235 0.1036 0.1518 0.1008 0.1048 0.0881 0.0629 0.0940 0.1188 0.0929 0.2731
va: 1.1231 1.1300 1.1155 1.9699 2.2524 2.0419 1.9300 1.9185 3.0910 3.6601 3.7610 4.0744 3.9396 3.9543 3.9588 3.9354 3.3237 3.8226 3.5431 3.8949 3.9803 3.8304 3.9530 3.8808 4.5128 3.9027 3.9595 3.9006 1.0277 1.0210 1.0126 1.0085 1.0041 1.0122 1.0103 1.0052 0.9940 1.0009 1.0201 1.0053 1.0001 1.0106 0.9960 0.9967 0.9887 0.9910 0.9893 1.0578
dispcorr: -0.027169346 hartree
energy: -1466.685636683756
dipole: 49.25670 -44.93650 4.32021 23.84207 -24.64714 -0.80507 11.09477 -9.84718 1.24759
magnitude: 4.56824 au
magnitude: 11.61154 debye
