program: Orca
programVersion: 5.0.2
elementType: F F F O O O O O N C C C C C C C C C C C C C C C C C C C H H H H H H H H H H H H H H H H H H H H
charge: 0
multiplicity: 1
keywords: wb97x-d3
keywords: def2-TZVPP
keywords: def2/J RIJCOSX
keywords: DEFGRID2
keywords: scfconv7
keywords: smallprint printgap noloewdin
keywords: NOSOSCF
formula: C19H20F3NO5
InChI: InChI=1/C19H20F3NO5/c1-27-6-7-28-9-13-12(4-5-14(23-13)19(20,21)22)18(26)15-16(24)10-2-3-11(8-10)17(15)25/h4-5,10-11,24H,2-3,6-9H2,1H3
48 atoms
F  -4.723142 -3.433361 -0.336037
F  -4.845096 -2.016311 1.277912
F  -5.526699 -1.468242 -0.685639
O  0.750699 -1.58714 1.134513
O  2.96061 1.217412 -1.924723
O  0.600936 0.598637 -2.39335
O  -0.460881 2.018758 0.192539
O  1.750233 4.840885 0.784175
N  -2.809731 -0.577687 0.330003
C  3.004588 -0.928714 1.541955
C  4.077047 0.517686 0.041321
C  3.646225 0.454133 1.502201
C  4.026589 -1.809697 0.781926
C  4.770445 -0.848805 -0.165012
C  1.70242 -0.909227 0.775074
C  2.855586 0.559588 -0.810263
C  1.685123 -0.091216 -0.435329
C  0.528208 0.041314 -1.28979
C  -0.793956 -0.551277 -0.926381
C  -1.627454 -0.043674 0.074766
C  -1.246279 -1.619662 -1.681768
C  -1.229819 1.113102 0.94107
C  -2.477291 -2.18828 -1.396717
C  -3.209468 -1.627847 -0.369577
C  -4.578537 -2.14318 -0.020138
C  0.252481 2.927879 1.00309
C  1.063258 3.829392 0.084006
C  2.8666 4.382265 1.517985
H  2.809266 -1.298068 2.548461
H  4.722692 1.360504 -0.205936
H  2.967688 1.25967 1.789535
H  4.518663 0.496151 2.155947
H  4.714698 -2.255511 1.499525
H  3.547868 -2.633132 0.251092
H  4.752528 -1.174312 -1.204945
H  5.817389 -0.748629 0.120646
H  -0.634944 -2.026728 -2.476741
H  -2.129903 1.589171 1.345638
H  -0.660902 0.730741 1.800349
H  -2.837825 -3.032181 -1.96737
H  0.901807 2.380614 1.699404
H  -0.436157 3.534356 1.606463
H  1.76068 3.225534 -0.510213
H  0.38949 4.333156 -0.613403
H  2.586604 3.798288 2.399963
H  3.536749 3.771352 0.900939
H  3.420193 5.25789 1.857085
H  2.082828 1.1264 -2.408131
elementType: F O N C H
totalener: -1466.65472353 hartree
nucrepener: 2857.23124748 hartree
electener: -4323.88597101 hartree
oneelecener: -7692.44213886 hartree
twoeener: 3368.55616785 hartree
cpcmener: -0.04928264 hartree
kineticenergy: 1460.83352440 hartree
xcener: -133.541108352883 hartree
chargesum: 0.0000000
charge: -0.178263 -0.171994 -0.179382 -0.497733 -0.319628 -0.461528 -0.364606 -0.403868 -0.350791 0.242135 0.218330 -0.269388 -0.228261 -0.202395 0.192590 0.140475 -0.187607 0.389415 0.035397 0.122879 -0.120345 -0.049963 -0.153286 0.120221 0.496518 0.001476 0.037620 -0.114321 0.072640 0.093386 0.090714 0.101827 0.099701 0.094562 0.096603 0.100939 0.155643 0.106963 0.118109 0.154281 0.092713 0.105322 0.082788 0.104850 0.097542 0.088682 0.124750 0.274292
qa: -0.1783 -0.1720 -0.1794 -0.4977 -0.3196 -0.4615 -0.3646 -0.4039 -0.3508 0.2421 0.2183 -0.2694 -0.2283 -0.2024 0.1926 0.1405 -0.1876 0.3894 0.0354 0.1229 -0.1203 -0.0500 -0.1533 0.1202 0.4965 0.0015 0.0376 -0.1143 0.0726 0.0934 0.0907 0.1018 0.0997 0.0946 0.0966 0.1009 0.1556 0.1070 0.1181 0.1543 0.0927 0.1053 0.0828 0.1048 0.0975 0.0887 0.1248 0.2743
va: 1.1235 1.1318 1.1125 1.9843 2.2306 2.0338 1.9487 1.9144 3.0962 3.6820 3.7198 4.0797 3.9612 3.9575 3.9857 3.9441 3.3154 3.7876 3.6075 3.9184 4.0288 4.0382 3.9684 3.8602 4.5068 3.8122 3.9145 3.9105 1.0275 1.0170 1.0160 1.0090 1.0032 1.0099 1.0125 1.0040 1.0041 1.0179 0.9897 1.0054 0.9913 1.0051 1.0177 1.0000 0.9788 0.9906 0.9929 1.0547
dispcorr: -0.028773542 hartree
energy: -1466.683497074767
dipole: 53.71453 -49.47136 4.24317 24.72666 -24.82827 -0.10160 9.71012 -9.30724 0.40288
magnitude: 4.26347 au
magnitude: 10.83687 debye
