program: Orca
programVersion: 5.0.2
elementType: F F F O O O O O N C C C C C C C C C C C C C C C C C C C H H H H H H H H H H H H H H H H H H H H
charge: 0
multiplicity: 1
keywords: wb97x-d3
keywords: def2-TZVPP
keywords: def2/J RIJCOSX
keywords: DEFGRID2
keywords: scfconv7
keywords: smallprint printgap noloewdin
keywords: NOSOSCF
formula: C19H20F3NO5
InChI: InChI=1/C19H20F3NO5/c1-27-6-7-28-9-13-12(4-5-14(23-13)19(20,21)22)18(26)15-16(24)10-2-3-11(8-10)17(15)25/h4-5,10-11,24H,2-3,6-9H2,1H3
48 atoms
F  -4.650187 -3.259121 -0.405507
F  -4.938875 -1.828396 1.174774
F  -5.435253 -1.306051 -0.849778
O  0.87724 -1.388998 1.281592
O  2.985251 1.433576 -1.839394
O  0.479045 1.289312 -1.852817
O  -0.228054 1.697092 1.260147
O  1.620622 3.65641 -0.046213
N  -2.928111 -0.265444 0.276289
C  3.257081 -1.293778 1.191335
C  4.289677 0.185946 -0.309556
C  4.143018 -0.052084 1.189735
C  3.917194 -2.191442 0.118214
C  4.635465 -1.223559 -0.841845
C  1.866187 -0.914655 0.74389
C  2.963061 0.579684 -0.860291
C  1.786507 0.025287 -0.373036
C  0.535671 0.423156 -0.971371
C  -0.743455 -0.278821 -0.6525
C  -1.750704 0.312495 0.112489
C  -0.997738 -1.497335 -1.255091
C  -1.54888 1.6384 0.782717
C  -2.235265 -2.098096 -1.084701
C  -3.160859 -1.430525 -0.308797
C  -4.548636 -1.964627 -0.092528
C  0.141692 2.955661 1.791489
C  0.496579 3.986776 0.738561
C  2.849972 3.766149 0.635393
H  3.190787 -1.786213 2.161024
H  5.035612 0.933929 -0.577043
H  3.710972 0.795849 1.724284
H  5.115494 -0.271582 1.632751
H  4.632727 -2.854175 0.604052
H  3.193315 -2.828098 -0.391337
H  4.342021 -1.35936 -1.882532
H  5.716365 -1.353333 -0.794246
H  -0.239275 -1.9800 -1.857916
H  -1.761087 2.437903 0.060548
H  -2.271939 1.746344 1.598743
H  -2.450592 -3.048489 -1.550966
H  0.990425 2.770715 2.453359
H  -0.662455 3.364318 2.415456
H  -0.335475 4.128019 0.044242
H  0.647972 4.945799 1.252367
H  2.996913 2.98211 1.38519
H  3.649606 3.683409 -0.099928
H  2.948752 4.735639 1.137151
H  2.039865 1.607499 -2.11473
elementType: F O N C H
totalener: -1466.65542814 hartree
nucrepener: 2886.35372322 hartree
electener: -4353.00915136 hartree
oneelecener: -7753.08835089 hartree
twoeener: 3400.07919952 hartree
cpcmener: -0.05330383 hartree
kineticenergy: 1460.87076006 hartree
xcener: -133.548221947449 hartree
chargesum: -0.0000000
charge: -0.178759 -0.174311 -0.178690 -0.495665 -0.313479 -0.466592 -0.355206 -0.405005 -0.350451 0.228908 0.242520 -0.281357 -0.227163 -0.206077 0.209345 0.159167 -0.267516 0.417986 0.037788 0.121832 -0.145244 -0.048976 -0.118628 0.107063 0.496016 -0.011822 0.036630 -0.133756 0.070032 0.089536 0.109179 0.100451 0.099722 0.095474 0.096662 0.100789 0.157754 0.123656 0.099037 0.152904 0.110185 0.095922 0.102461 0.094232 0.098005 0.113550 0.119091 0.272798
qa: -0.1788 -0.1743 -0.1787 -0.4957 -0.3135 -0.4666 -0.3552 -0.4050 -0.3505 0.2289 0.2425 -0.2814 -0.2272 -0.2061 0.2093 0.1592 -0.2675 0.4180 0.0378 0.1218 -0.1452 -0.0490 -0.1186 0.1071 0.4960 -0.0118 0.0366 -0.1338 0.0700 0.0895 0.1092 0.1005 0.0997 0.0955 0.0967 0.1008 0.1578 0.1237 0.0990 0.1529 0.1102 0.0959 0.1025 0.0942 0.0980 0.1136 0.1191 0.2728
va: 1.1237 1.1278 1.1154 1.9802 2.2373 2.0237 1.9464 1.8871 3.1128 3.6854 3.7126 4.0683 3.9537 3.9576 3.9949 3.9369 3.3960 3.7493 3.5718 3.9834 4.0055 4.0174 3.9257 3.8632 4.5099 3.8763 3.8545 3.8956 1.0268 1.0174 1.0108 1.0088 1.0043 1.0100 1.0121 1.0039 0.9986 0.9857 1.0171 1.0044 0.9942 1.0068 1.0028 1.0088 0.9772 0.9947 0.9964 1.0528
dispcorr: -0.028897632 hartree
energy: -1466.684325772351
dipole: 52.09497 -48.08965 4.00532 23.04547 -22.27829 0.76717 6.93005 -6.88606 0.04399
magnitude: 4.07837 au
magnitude: 10.36639 debye
