program: Orca
programVersion: 5.0.2
elementType: F F F O O O O O N C C C C C C C C C C C C C C C C C C C H H H H H H H H H H H H H H H H H H H H
charge: 0
multiplicity: 1
keywords: wb97x-d3
keywords: def2-TZVPP
keywords: def2/J RIJCOSX
keywords: DEFGRID2
keywords: scfconv7
keywords: smallprint printgap noloewdin
keywords: NOSOSCF
formula: C19H20F3NO5
InChI: InChI=1/C19H20F3NO5/c1-27-6-7-28-9-13-12(4-5-14(23-13)19(20,21)22)18(26)15-16(24)10-2-3-11(8-10)17(15)25/h4-5,10-11,24H,2-3,6-9H2,1H3
48 atoms
F  -4.777491 -3.133933 -0.890109
F  -4.710004 -2.321034 1.102581
F  -5.51781 -1.15171 -0.506108
O  0.701891 -1.189508 1.366722
O  3.016085 1.343425 -1.850393
O  0.515332 1.248694 -1.974129
O  -0.388722 1.955486 0.886912
O  2.020085 3.472741 0.355216
N  -3.005844 -0.240709 0.067602
C  3.08755 -1.220244 1.329228
C  4.22498 0.147573 -0.203952
C  4.014562 -0.008505 1.298062
C  3.748782 -2.190908 0.321583
C  4.547257 -1.297819 -0.647751
C  1.727091 -0.811656 0.819924
C  2.933544 0.545674 -0.828724
C  1.722977 0.048716 -0.362406
C  0.512447 0.430944 -1.045645
C  -0.78039 -0.259849 -0.757674
C  -1.836022 0.355649 -0.083598
C  -0.980772 -1.523721 -1.284705
C  -1.716592 1.732034 0.49691
C  -2.213128 -2.140945 -1.135645
C  -3.188461 -1.445293 -0.450311
C  -4.553251 -2.019253 -0.192454
C  -0.16234 3.286399 1.30234
C  1.301972 3.504177 1.56687
C  3.376353 3.805227 0.536895
H  2.975142 -1.661142 2.31921
H  5.003159 0.859268 -0.478713
H  3.591161 0.877876 1.774158
H  4.962414 -0.235235 1.788392
H  4.413877 -2.863913 0.861844
H  3.016659 -2.815712 -0.190952
H  4.302533 -1.477524 -1.694336
H  5.619406 -1.459043 -0.536982
H  -0.182476 -2.030343 -1.811945
H  -2.033657 2.466238 -0.257817
H  -2.408285 1.828327 1.34167
H  -2.382347 -3.126856 -1.543426
H  -0.717478 3.499275 2.223449
H  -0.515173 3.994164 0.54122
H  1.409412 4.479395 2.058949
H  1.680306 2.748695 2.269366
H  3.495013 4.822022 0.928177
H  3.882562 3.12092 1.226001
H  3.873961 3.752337 -0.429901
H  2.08434 1.524557 -2.170172
elementType: F O N C H
totalener: -1466.65899172 hartree
nucrepener: 2882.87045028 hartree
electener: -4349.52944200 hartree
oneelecener: -7746.25002667 hartree
twoeener: 3396.72058467 hartree
cpcmener: -0.05188324 hartree
kineticenergy: 1460.87926262 hartree
xcener: -133.548703943765 hartree
chargesum: 0.0000000
charge: -0.177307 -0.178316 -0.175527 -0.495143 -0.316426 -0.468302 -0.350015 -0.386247 -0.356645 0.248618 0.223854 -0.275788 -0.231457 -0.202328 0.205407 0.178566 -0.312067 0.452115 0.047210 0.115380 -0.150148 -0.025018 -0.110931 0.098150 0.495047 0.023573 0.015441 -0.135256 0.070193 0.092528 0.099762 0.101140 0.099137 0.095314 0.096506 0.100917 0.157056 0.116742 0.098547 0.153620 0.092550 0.083772 0.099164 0.084795 0.118023 0.097443 0.112925 0.273427
qa: -0.1773 -0.1783 -0.1755 -0.4951 -0.3164 -0.4683 -0.3500 -0.3862 -0.3566 0.2486 0.2239 -0.2758 -0.2315 -0.2023 0.2054 0.1786 -0.3121 0.4521 0.0472 0.1154 -0.1501 -0.0250 -0.1109 0.0982 0.4950 0.0236 0.0154 -0.1353 0.0702 0.0925 0.0998 0.1011 0.0991 0.0953 0.0965 0.1009 0.1571 0.1167 0.0985 0.1536 0.0925 0.0838 0.0992 0.0848 0.1180 0.0974 0.1129 0.2734
va: 1.1257 1.1178 1.1259 1.9809 2.2329 2.0241 1.9803 1.9012 3.1064 3.6662 3.7180 4.0679 3.9617 3.9583 3.9852 3.9105 3.3913 3.7423 3.5918 3.9899 4.0082 4.0022 3.9147 3.8810 4.5155 3.9194 3.9312 3.8931 1.0264 1.0148 1.0128 1.0088 1.0046 1.0095 1.0125 1.0043 0.9989 0.9925 1.0103 1.0031 0.9962 1.0049 1.0016 0.9970 0.9950 0.9809 0.9961 1.0527
dispcorr: -0.028475852 hartree
energy: -1466.687467566799
dipole: 53.50565 -49.30468 4.20097 22.98570 -22.40380 0.58190 8.27197 -8.18584 0.08613
magnitude: 4.24196 au
magnitude: 10.78220 debye
