program: Orca
programVersion: 5.0.2
elementType: F F F O O O O O N C C C C C C C C C C C C C C C C C C C H H H H H H H H H H H H H H H H H H H H
charge: 0
multiplicity: 1
keywords: wb97x-d3
keywords: def2-TZVPP
keywords: def2/J RIJCOSX
keywords: DEFGRID2
keywords: scfconv7
keywords: smallprint printgap noloewdin
keywords: NOSOSCF
formula: C19H20F3NO5
InChI: InChI=1/C19H20F3NO5/c1-27-6-7-28-9-13-12(4-5-14(23-13)19(20,21)22)18(26)15-16(24)10-2-3-11(8-10)17(15)25/h4-5,10-11,24H,2-3,6-9H2,1H3
48 atoms
F  -4.845089 -3.284991 -0.657678
F  -4.555228 -2.51402 1.330872
F  -5.529692 -1.309342 -0.155519
O  0.795126 -1.764205 0.941861
O  2.93325 1.327449 -1.88108
O  0.536082 0.815671 -2.304378
O  -0.418725 1.943767 0.455843
O  1.810348 4.615256 1.317896
N  -2.761289 -0.656814 0.437537
C  3.064305 -1.167481 1.345797
C  4.112485 0.389583 -0.055729
C  3.744173 0.195012 1.410907
C  4.040786 -1.99602 0.476567
C  4.750537 -0.970429 -0.427843
C  1.73858 -1.05256 0.628603
C  2.856428 0.555993 -0.8390
C  1.685898 -0.104596 -0.48249
C  0.497083 0.140339 -1.267354
C  -0.818593 -0.475209 -0.917457
C  -1.594456 -0.092742 0.182771
C  -1.323347 -1.435675 -1.775251
C  -1.142289 0.960139 1.149657
C  -2.543092 -2.03423 -1.496169
C  -3.2086 -1.612399 -0.364899
C  -4.538064 -2.187081 0.036922
C  0.357028 2.758658 1.306616
C  1.089005 3.771717 0.450692
C  2.602316 5.550264 0.623242
H  2.891373 -1.624687 2.31991
H  4.777074 1.231329 -0.24938
H  3.106384 0.987348 1.807284
H  4.645646 0.146732 2.023595
H  4.756556 -2.494887 1.129265
H  3.532286 -2.776261 -0.090153
H  4.655108 -1.199275 -1.489154
H  5.816359 -0.92237 -0.206154
H  -0.761461 -1.742504 -2.647877
H  -2.014173 1.38702 1.657611
H  -0.523287 0.488467 1.925575
H  -2.939331 -2.796767 -2.150576
H  1.075861 2.149987 1.872015
H  -0.281894 3.275152 2.034977
H  1.762307 3.258994 -0.248964
H  0.372144 4.347083 -0.1511
H  3.108936 6.1745 1.358668
H  3.362012 5.06209 0.002069
H  2.001128 6.198791 -0.023972
H  2.035053 1.312941 -2.330895
elementType: F O N C H
totalener: -1466.65651088 hartree
nucrepener: 2839.39397318 hartree
electener: -4306.05048406 hartree
oneelecener: -7657.39900625 hartree
twoeener: 3351.34852219 hartree
cpcmener: -0.04613646 hartree
kineticenergy: 1460.83042496 hartree
xcener: -133.539086916569 hartree
chargesum: -0.0000000
charge: -0.177884 -0.175385 -0.177879 -0.497981 -0.319671 -0.463782 -0.361161 -0.396943 -0.350731 0.231312 0.234009 -0.279202 -0.224293 -0.207606 0.195432 0.146424 -0.199741 0.395714 0.029928 0.121278 -0.118120 -0.047126 -0.140499 0.111851 0.495976 0.014842 0.035155 -0.113327 0.073618 0.087080 0.106299 0.100398 0.100138 0.094376 0.096678 0.100548 0.155408 0.107470 0.118627 0.153144 0.088602 0.107530 0.078626 0.090919 0.117621 0.095444 0.093298 0.273586
qa: -0.1779 -0.1754 -0.1779 -0.4980 -0.3197 -0.4638 -0.3612 -0.3969 -0.3507 0.2313 0.2340 -0.2792 -0.2243 -0.2076 0.1954 0.1464 -0.1997 0.3957 0.0299 0.1213 -0.1181 -0.0471 -0.1405 0.1119 0.4960 0.0148 0.0352 -0.1133 0.0736 0.0871 0.1063 0.1004 0.1001 0.0944 0.0967 0.1005 0.1554 0.1075 0.1186 0.1531 0.0886 0.1075 0.0786 0.0909 0.1176 0.0954 0.0933 0.2736
va: 1.1248 1.1258 1.1188 1.9830 2.2320 2.0317 1.9507 1.9070 3.1107 3.6808 3.7253 4.0695 3.9514 3.9492 3.9869 3.9503 3.3410 3.7807 3.6015 3.9127 4.0274 4.0323 3.9392 3.8705 4.5108 3.8630 3.9137 3.9081 1.0276 1.0198 1.0139 1.0086 1.0034 1.0111 1.0118 1.0043 1.0043 1.0173 0.9907 1.0049 0.9956 1.0030 0.9986 1.0007 0.9913 0.9897 0.9883 1.0547
dispcorr: -0.027274585 hartree
energy: -1466.683785469425
dipole: 52.94299 -48.86800 4.07499 27.60993 -26.97796 0.63197 5.68477 -6.23016 -0.54540
magnitude: 4.15962 au
magnitude: 10.57290 debye
