program: Orca
programVersion: 5.0.2
elementType: F F F O O O O O N C C C C C C C C C C C C C C C C C C C H H H H H H H H H H H H H H H H H H H H
charge: 0
multiplicity: 1
keywords: wb97x-d3
keywords: def2-TZVPP
keywords: def2/J RIJCOSX
keywords: DEFGRID2
keywords: scfconv7
keywords: smallprint printgap noloewdin
keywords: NOSOSCF
formula: C19H20F3NO5
InChI: InChI=1/C19H20F3NO5/c1-27-6-7-28-9-13-12(4-5-14(23-13)19(20,21)22)18(26)15-16(24)10-2-3-11(8-10)17(15)25/h4-5,10-11,24H,2-3,6-9H2,1H3
48 atoms
F  -4.804023 -2.039657 1.413148
F  -5.543377 -1.480713 -0.525971
F  -4.727464 -3.446107 -0.212341
O  0.759739 -1.622732 1.179688
O  2.9712 1.108367 -1.94441
O  0.59655 0.528747 -2.36994
O  -0.40202 1.970333 0.22456
O  1.803634 4.703951 0.941417
N  -2.794401 -0.59101 0.409209
C  3.032394 -1.002011 1.54392
C  4.108125 0.404465 0.008582
C  3.6981 0.368637 1.476242
C  4.026734 -1.911782 0.780562
C  4.775175 -0.976123 -0.187455
C  1.718584 -0.967689 0.797355
C  2.873923 0.459502 -0.82403
C  1.697981 -0.166191 -0.423934
C  0.529684 -0.018988 -1.261015
C  -0.796815 -0.589981 -0.877736
C  -1.612202 -0.067922 0.131043
C  -1.272665 -1.6561 -1.621958
C  -1.194145 1.092993 0.981894
C  -2.50439 -2.211809 -1.314883
C  -3.213804 -1.642688 -0.27665
C  -4.57481 -2.157513 0.107032
C  0.311112 2.883151 1.028715
C  1.13722 3.772058 0.122304
C  2.653915 5.553797 0.207191
H  2.846607 -1.354989 2.558081
H  4.765753 1.231153 -0.259722
H  3.038783 1.190987 1.761202
H  4.580595 0.403186 2.11684
H  4.716168 -2.36316 1.493379
H  3.524721 -2.731492 0.265886
H  4.741301 -1.314981 -1.222661
H  5.826495 -0.889064 0.086374
H  -0.678929 -2.072719 -2.425183
H  -2.085602 1.595485 1.373505
H  -0.638926 0.71171 1.850569
H  -2.881612 -3.053673 -1.877405
H  0.963869 2.348539 1.732086
H  -0.380253 3.495034 1.622993
H  1.854421 3.168802 -0.449656
H  0.48801 4.279451 -0.604506
H  3.12176 6.246675 0.905864
H  3.444194 4.996374 -0.30831
H  2.10616 6.136521 -0.542144
H  2.081738 1.03094 -2.410083
elementType: F O N C H
totalener: -1466.65603549 hartree
nucrepener: 2838.73685633 hartree
electener: -4305.39289182 hartree
oneelecener: -7656.07262878 hartree
twoeener: 3350.67973696 hartree
cpcmener: -0.04578460 hartree
kineticenergy: 1460.83328926 hartree
xcener: -133.539477421974 hartree
chargesum: -0.0000000
charge: -0.172041 -0.179226 -0.178319 -0.498196 -0.321700 -0.461556 -0.360198 -0.397108 -0.352491 0.236812 0.232154 -0.277917 -0.228718 -0.201626 0.196365 0.140612 -0.200199 0.396097 0.035570 0.121459 -0.120809 -0.046003 -0.152266 0.118603 0.496825 0.014725 0.031709 -0.113331 0.072531 0.088131 0.104253 0.100688 0.099359 0.094671 0.096439 0.100732 0.155786 0.107979 0.117285 0.153859 0.089617 0.105972 0.079922 0.093353 0.117801 0.094785 0.093854 0.273757
qa: -0.1720 -0.1792 -0.1783 -0.4982 -0.3217 -0.4616 -0.3602 -0.3971 -0.3525 0.2368 0.2322 -0.2779 -0.2287 -0.2016 0.1964 0.1406 -0.2002 0.3961 0.0356 0.1215 -0.1208 -0.0460 -0.1523 0.1186 0.4968 0.0147 0.0317 -0.1133 0.0725 0.0881 0.1043 0.1007 0.0994 0.0947 0.0964 0.1007 0.1558 0.1080 0.1173 0.1539 0.0896 0.1060 0.0799 0.0934 0.1178 0.0948 0.0939 0.2738
va: 1.1315 1.1132 1.1231 1.9843 2.2269 2.0345 1.9527 1.9064 3.0954 3.6700 3.7284 4.0706 3.9584 3.9450 3.9865 3.9560 3.3392 3.7763 3.6108 3.9178 4.0303 4.0332 3.9670 3.8646 4.5058 3.8619 3.9157 3.9075 1.0273 1.0195 1.0149 1.0086 1.0035 1.0098 1.0126 1.0042 1.0041 1.0168 0.9913 1.0055 0.9959 1.0029 0.9971 1.0005 0.9912 0.9897 0.9885 1.0561
dispcorr: -0.027305983 hartree
energy: -1466.683341474622
dipole: 53.20022 -49.10695 4.09327 28.03393 -27.47116 0.56277 4.76364 -5.20320 -0.43955
magnitude: 4.15509 au
magnitude: 10.56139 debye
