program: Orca
programVersion: 5.0.2
elementType: F F F O O O O O N C C C C C C C C C C C C C C C C C C C H H H H H H H H H H H H H H H H H H H H
charge: 0
multiplicity: 1
keywords: wb97x-d3
keywords: def2-TZVPP
keywords: def2/J RIJCOSX
keywords: DEFGRID2
keywords: scfconv7
keywords: smallprint printgap noloewdin
keywords: NOSOSCF
formula: C19H20F3NO5
InChI: InChI=1/C19H20F3NO5/c1-27-6-7-28-9-13-12(4-5-14(23-13)19(20,21)22)18(26)15-16(24)10-2-3-11(8-10)17(15)25/h4-5,10-11,24H,2-3,6-9H2,1H3
48 atoms
F  -5.470508 -1.3314 -0.869478
F  -4.671035 -3.292499 -0.487593
F  -4.874383 -1.879154 1.121586
O  0.619035 -1.296682 1.288742
O  3.096657 1.263579 -1.785792
O  0.679372 0.902249 -2.241554
O  -0.228302 2.021474 0.442942
O  2.363263 3.349534 0.684864
N  -2.862625 -0.367386 0.211013
C  2.986711 -1.134435 1.51278
C  4.184036 0.283432 0.076389
C  3.808739 0.150419 1.547857
C  3.833379 -2.07138 0.617533
C  4.685445 -1.138369 -0.264544
C  1.664134 -0.843963 0.845257
C  2.95058 0.533268 -0.721198
C  1.729741 -0.02361 -0.362236
C  0.580358 0.259093 -1.187897
C  -0.755538 -0.338333 -0.881891
C  -1.684583 0.199398 0.010879
C  -1.106145 -1.478672 -1.586301
C  -1.446334 1.445092 0.811597
C  -2.338304 -2.072765 -1.368552
C  -3.171993 -1.471366 -0.44735
C  -4.549189 -2.002299 -0.164871
C  -0.095384 3.380682 0.799891
C  1.176344 3.932689 0.196533
C  2.710053 3.767124 1.986311
H  2.795446 -1.561431 2.496835
H  4.923663 1.055517 -0.134923
H  3.255044 1.005037 1.936793
H  4.704978 0.021948 2.156445
H  4.467665 -2.692341 1.249116
H  3.213441 -2.750032 0.030875
H  4.610007 -1.366536 -1.327643
H  5.740269 -1.202459 0.002654
H  -0.414633 -1.917562 -2.294235
H  -2.284249 2.131163 0.632497
H  -1.466193 1.196074 1.881099
H  -2.620447 -2.965869 -1.907138
H  -0.109229 3.499143 1.89058
H  -0.935184 3.966612 0.404653
H  1.166555 3.766124 -0.883541
H  1.179726 5.018489 0.35804
H  2.030989 3.38292 2.753979
H  3.710112 3.391805 2.201001
H  2.729459 4.860137 2.066488
H  2.202442 1.302919 -2.244058
elementType: F O N C H
totalener: -1466.65460024 hartree
nucrepener: 2884.84407437 hartree
electener: -4351.49867461 hartree
oneelecener: -7750.15247404 hartree
twoeener: 3398.65379943 hartree
cpcmener: -0.04615251 hartree
kineticenergy: 1460.87513298 hartree
xcener: -133.551303999222 hartree
chargesum: -0.0000000
charge: -0.179173 -0.178468 -0.173737 -0.498136 -0.320022 -0.468220 -0.335022 -0.394194 -0.373278 0.237283 0.242844 -0.288342 -0.231438 -0.204299 0.219463 0.130138 -0.246054 0.427399 0.098521 0.093980 -0.144914 -0.005458 -0.142417 0.102130 0.495458 -0.005604 0.022075 -0.138556 0.069695 0.087071 0.103120 0.101360 0.098190 0.095170 0.095891 0.100295 0.154827 0.106468 0.107030 0.152824 0.093068 0.092352 0.091177 0.100399 0.108170 0.113607 0.113581 0.273748
qa: -0.1792 -0.1785 -0.1737 -0.4981 -0.3200 -0.4682 -0.3350 -0.3942 -0.3733 0.2373 0.2428 -0.2883 -0.2314 -0.2043 0.2195 0.1301 -0.2461 0.4274 0.0985 0.0940 -0.1449 -0.0055 -0.1424 0.1021 0.4955 -0.0056 0.0221 -0.1386 0.0697 0.0871 0.1031 0.1014 0.0982 0.0952 0.0959 0.1003 0.1548 0.1065 0.1070 0.1528 0.0931 0.0924 0.0912 0.1004 0.1082 0.1136 0.1136 0.2737
va: 1.1133 1.1238 1.1288 1.9859 2.2278 2.0214 1.9779 1.8929 3.0824 3.7064 3.7041 4.0783 3.9595 3.9509 3.9699 3.9514 3.3958 3.7592 3.5743 3.9648 4.0426 3.9989 3.9453 3.8904 4.5098 3.8837 3.9088 3.8996 1.0278 1.0219 1.0175 1.0084 1.0050 1.0086 1.0128 1.0043 1.0028 1.0022 1.0007 1.0049 0.9854 1.0001 1.0081 1.0035 0.9777 0.9871 0.9960 1.0538
dispcorr: -0.028290648 hartree
energy: -1466.682890889317
dipole: 50.47133 -47.23362 3.23771 24.69121 -23.50876 1.18245 10.72294 -10.32074 0.40220
magnitude: 3.47026 au
magnitude: 8.82070 debye
