program: Orca
programVersion: 5.0.2
elementType: F F F O O O O O N C C C C C C C C C C C C C C C C C C C H H H H H H H H H H H H H H H H H H H H
charge: 0
multiplicity: 1
keywords: wb97x-d3
keywords: def2-TZVPP
keywords: def2/J RIJCOSX
keywords: DEFGRID2
keywords: scfconv7
keywords: smallprint printgap noloewdin
keywords: NOSOSCF
formula: C19H20F3NO5
InChI: InChI=1/C19H20F3NO5/c1-27-6-7-28-9-13-12(4-5-14(23-13)19(20,21)22)18(26)15-16(24)10-2-3-11(8-10)17(15)25/h4-5,10-11,24H,2-3,6-9H2,1H3
48 atoms
F  -5.503208 -1.29039 -0.801365
F  -4.701902 -3.254224 -0.439887
F  -4.868449 -1.844148 1.176377
O  0.661869 -1.512339 1.128946
O  3.067352 1.290186 -1.788669
O  0.668991 0.875403 -2.275187
O  -0.336455 2.116875 0.350824
O  2.289744 3.496241 0.45429
N  -2.815076 -0.402438 0.294276
C  3.001845 -1.189334 1.444944
C  4.157988 0.324255 0.076408
C  3.764222 0.128056 1.535496
C  3.90947 -2.060119 0.541082
C  4.7293 -1.062905 -0.299723
C  1.679977 -0.947322 0.756315
C  2.928917 0.547254 -0.733873
C  1.71845 -0.05003 -0.39681
C  0.57054 0.226543 -1.224939
C  -0.77119 -0.349232 -0.911002
C  -1.630305 0.143007 0.07385
C  -1.203679 -1.407273 -1.693461
C  -1.290048 1.297917 0.967534
C  -2.439846 -1.982575 -1.449888
C  -3.195645 -1.441794 -0.429098
C  -4.569797 -1.965127 -0.115919
C  -0.075958 3.300032 1.078055
C  1.010358 4.087143 0.383413
C  2.947561 3.726151 1.680292
H  2.810689 -1.656243 2.410748
H  4.866054 1.134406 -0.098078
H  3.168559 0.945644 1.942631
H  4.656183 0.017798 2.153935
H  4.562766 -2.665126 1.168768
H  3.334937 -2.752728 -0.074629
H  4.679966 -1.261753 -1.370183
H  5.78193 -1.085403 -0.017946
H  -0.571734 -1.801409 -2.478914
H  -2.212125 1.850927 1.183882
H  -0.921323 0.912207 1.929386
H  -2.783984 -2.815683 -2.045887
H  0.203554 3.065416 2.113586
H  -0.977983 3.923666 1.125688
H  0.762572 4.189135 -0.676292
H  1.024417 5.097807 0.810064
H  3.028389 4.797405 1.897775
H  2.45077 3.246302 2.529597
H  3.954324 3.316903 1.601479
H  2.179074 1.305861 -2.261021
elementType: F O N C H
totalener: -1466.65571415 hartree
nucrepener: 2877.86348922 hartree
electener: -4344.51920337 hartree
oneelecener: -7735.96573661 hartree
twoeener: 3391.44653324 hartree
cpcmener: -0.04832869 hartree
kineticenergy: 1460.86770491 hartree
xcener: -133.547734835144 hartree
chargesum: -0.0000000
charge: -0.179419 -0.178271 -0.172671 -0.499529 -0.317834 -0.463961 -0.348916 -0.393986 -0.359910 0.240607 0.220997 -0.287600 -0.229584 -0.202850 0.218783 0.135423 -0.226718 0.408992 0.058318 0.100505 -0.127165 -0.010837 -0.154639 0.115140 0.496251 0.001018 0.025854 -0.137334 0.070899 0.091606 0.109110 0.101102 0.098745 0.095159 0.096849 0.100763 0.155850 0.106695 0.112456 0.154308 0.088282 0.093920 0.092768 0.094127 0.117741 0.100823 0.114577 0.273555
qa: -0.1794 -0.1783 -0.1727 -0.4995 -0.3178 -0.4640 -0.3489 -0.3940 -0.3599 0.2406 0.2210 -0.2876 -0.2296 -0.2028 0.2188 0.1354 -0.2267 0.4090 0.0583 0.1005 -0.1272 -0.0108 -0.1546 0.1151 0.4963 0.0010 0.0259 -0.1373 0.0709 0.0916 0.1091 0.1011 0.0987 0.0952 0.0968 0.1008 0.1558 0.1067 0.1125 0.1543 0.0883 0.0939 0.0928 0.0941 0.1177 0.1008 0.1146 0.2736
va: 1.1122 1.1236 1.1308 1.9835 2.2288 2.0298 1.9571 1.8967 3.0853 3.6908 3.7125 4.0776 3.9572 3.9566 3.9751 3.9524 3.3749 3.7586 3.5880 3.9754 4.0330 3.9843 3.9655 3.8726 4.5082 3.8763 3.9109 3.9032 1.0279 1.0195 1.0092 1.0078 1.0044 1.0093 1.0127 1.0045 1.0029 1.0096 0.9976 1.0050 0.9908 1.0003 1.0069 1.0037 0.9977 0.9773 0.9845 1.0559
dispcorr: -0.028127102 hartree
energy: -1466.683841249732
dipole: 51.60064 -48.10142 3.49923 24.18789 -23.18182 1.00606 11.29698 -10.44863 0.84835
magnitude: 3.73851 au
magnitude: 9.50254 debye
