program: Orca
programVersion: 5.0.2
elementType: F F F O O O O O N C C C C C C C C C C C C C C C C C C C H H H H H H H H H H H H H H H H H H H H
charge: 0
multiplicity: 1
keywords: wb97x-d3
keywords: def2-TZVPP
keywords: def2/J RIJCOSX
keywords: DEFGRID2
keywords: scfconv7
keywords: smallprint printgap noloewdin
keywords: NOSOSCF
formula: C19H20F3NO5
InChI: InChI=1/C19H20F3NO5/c1-27-6-7-28-9-13-12(4-5-14(23-13)19(20,21)22)18(26)15-16(24)10-2-3-11(8-10)17(15)25/h4-5,10-11,24H,2-3,6-9H2,1H3
48 atoms
F  -4.556608 -2.402049 1.220599
F  -5.40343 -1.170289 -0.321447
F  -4.736315 -3.162093 -0.783726
O  0.576437 -0.569065 1.667814
O  3.327858 0.657473 -1.938266
O  0.853037 0.528011 -2.31639
O  -0.33564 2.154877 -0.061525
O  1.923502 3.424677 1.115087
N  -2.925865 -0.231514 -0.273801
C  2.948024 -0.717332 1.891103
C  4.308468 0.011752 0.120713
C  3.964317 0.372912 1.561617
C  3.619778 -1.995113 1.333192
C  4.563434 -1.510221 0.215708
C  1.669547 -0.448382 1.13576
C  3.105084 0.230242 -0.730297
C  1.827994 -0.047511 -0.261366
C  0.712508 0.085846 -1.168796
C  -0.625262 -0.481099 -0.815338
C  -1.733884 0.301234 -0.493674
C  -0.794429 -1.852444 -0.917047
C  -1.646768 1.794867 -0.39814
C  -2.045047 -2.405725 -0.699566
C  -3.075487 -1.540459 -0.38229
C  -4.451634 -2.066266 -0.073206
C  -0.002418 3.480038 -0.415871
C  1.475547 3.703747 -0.191552
C  1.404261 4.286529 2.102746
H  2.719321 -0.797285 2.953399
H  5.157085 0.55791 -0.290168
H  3.575622 1.384838 1.676155
H  4.849109 0.275844 2.192817
H  4.182957 -2.477225 2.131603
H  2.889952 -2.723442 0.978551
H  4.402332 -2.022835 -0.732593
H  5.607028 -1.665035 0.489695
H  0.044316 -2.491021 -1.163467
H  -1.937964 2.222555 -1.368058
H  -2.370522 2.159787 0.339197
H  -2.191141 -3.474038 -0.774499
H  -0.608626 4.193408 0.156519
H  -0.210635 3.666517 -1.477411
H  2.05168 3.058723 -0.858807
H  1.69735 4.742464 -0.472424
H  0.34215 4.113324 2.302473
H  1.953319 4.099237 3.02521
H  1.533745 5.341183 1.833902
H  2.441375 0.736387 -2.39891
elementType: F O N C H
totalener: -1466.65569265 hartree
nucrepener: 2875.69663131 hartree
electener: -4342.35232396 hartree
oneelecener: -7731.75143740 hartree
twoeener: 3389.39911344 hartree
cpcmener: -0.04993391 hartree
kineticenergy: 1460.84816621 hartree
xcener: -133.544144569736 hartree
chargesum: -0.0000000
charge: -0.180155 -0.171338 -0.178837 -0.493495 -0.319336 -0.473912 -0.349860 -0.395193 -0.356706 0.249121 0.241173 -0.292568 -0.227779 -0.209448 0.189395 0.206999 -0.326955 0.469874 0.050427 0.125785 -0.156076 -0.031844 -0.132674 0.109625 0.498574 -0.007023 0.014612 -0.112631 0.068672 0.084329 0.100615 0.100809 0.099507 0.093814 0.096053 0.100635 0.156719 0.114853 0.097750 0.154584 0.107037 0.104573 0.091949 0.107387 0.099307 0.108557 0.098710 0.274384
qa: -0.1802 -0.1713 -0.1788 -0.4935 -0.3193 -0.4739 -0.3499 -0.3952 -0.3567 0.2491 0.2412 -0.2926 -0.2278 -0.2094 0.1894 0.2070 -0.3270 0.4699 0.0504 0.1258 -0.1561 -0.0318 -0.1327 0.1096 0.4986 -0.0070 0.0146 -0.1126 0.0687 0.0843 0.1006 0.1008 0.0995 0.0938 0.0961 0.1006 0.1567 0.1149 0.0977 0.1546 0.1070 0.1046 0.0919 0.1074 0.0993 0.1086 0.0987 0.2744
va: 1.1107 1.1333 1.1221 1.9805 2.2454 2.0151 1.9590 1.8894 3.0906 3.6478 3.7261 4.0557 3.9559 3.9426 3.9950 3.9294 3.4045 3.7083 3.6054 3.9671 4.0142 4.0200 3.9600 3.8713 4.5043 3.8407 3.9130 3.9111 1.0269 1.0201 1.0412 1.0085 1.0048 1.0100 1.0118 1.0038 0.9990 0.9901 1.0099 1.0042 0.9866 1.0021 1.0019 1.0015 0.9813 0.9919 0.9905 1.0507
dispcorr: -0.027946830 hartree
energy: -1466.683639475573
dipole: 47.56488 -44.15875 3.40613 25.80001 -25.07099 0.72902 7.71404 -8.28684 -0.57280
magnitude: 3.53005 au
magnitude: 8.97268 debye
