program: Orca
programVersion: 5.0.2
elementType: F F F O O O O O N C C C C C C C C C C C C C C C C C C C H H H H H H H H H H H H H H H H H H H H
charge: 0
multiplicity: 1
keywords: wb97x-d3
keywords: def2-TZVPP
keywords: def2/J RIJCOSX
keywords: DEFGRID2
keywords: scfconv7
keywords: smallprint printgap noloewdin
keywords: NOSOSCF
formula: C19H20F3NO5
InChI: InChI=1/C19H20F3NO5/c1-27-6-7-28-9-13-12(4-5-14(23-13)19(20,21)22)18(26)15-16(24)10-2-3-11(8-10)17(15)25/h4-5,10-11,24H,2-3,6-9H2,1H3
48 atoms
F  -4.629519 -2.174818 1.246853
F  -5.386219 -1.265092 -0.546559
F  -4.593073 -3.262349 -0.608087
O  0.893566 -1.897414 0.940646
O  3.189098 1.379777 -1.536334
O  0.783781 0.976055 -2.051056
O  -0.039449 1.858415 0.8915
O  0.915721 4.516877 1.031702
N  -2.596707 -0.610333 0.501448
C  3.191751 -1.466677 1.390799
C  4.315156 0.190484 0.171926
C  3.923575 -0.146921 1.605874
C  4.135055 -2.234118 0.43262
C  4.900773 -1.145828 -0.343386
C  1.878642 -1.218841 0.688297
C  3.076048 0.489757 -0.596675
C  1.882756 -0.172345 -0.331302
C  0.712348 0.19761 -1.090077
C  -0.626779 -0.398106 -0.807613
C  -1.406955 -0.067111 0.30392
C  -1.143174 -1.283943 -1.737241
C  -0.931624 0.887439 1.368411
C  -2.382228 -1.863111 -1.516028
C  -3.055991 -1.496668 -0.368285
C  -4.418755 -2.055668 -0.062399
C  -0.667478 2.934193 0.219605
C  0.371526 3.960652 -0.143018
C  1.911352 5.473808 0.756503
H  2.995466 -2.02006 2.308831
H  5.015548 1.019779 0.076271
H  3.311491 0.621948 2.07998
H  4.815567 -0.295616 2.216128
H  4.819918 -2.843477 1.021563
H  3.592108 -2.914529 -0.223813
H  4.812695 -1.250503 -1.424541
H  5.963916 -1.168664 -0.105776
H  -0.574272 -1.549029 -2.618939
H  -1.803977 1.341017 1.852353
H  -0.404503 0.316896 2.138652
H  -2.78883 -2.570798 -2.224108
H  -1.439535 3.381941 0.858154
H  -1.163791 2.601402 -0.699768
H  1.159485 3.505496 -0.758297
H  -0.109211 4.730469 -0.761018
H  1.51964 6.323418 0.185228
H  2.292917 5.846187 1.70674
H  2.748285 5.045939 0.192665
H  2.300362 1.44406 -1.997971
elementType: F O N C H
totalener: -1466.65829621 hartree
nucrepener: 2845.91516635 hartree
electener: -4312.57346256 hartree
oneelecener: -7671.28352200 hartree
twoeener: 3358.71005944 hartree
cpcmener: -0.04603759 hartree
kineticenergy: 1460.85452321 hartree
xcener: -133.543423100302 hartree
chargesum: 0.0000000
charge: -0.172540 -0.179323 -0.178286 -0.497010 -0.319034 -0.467523 -0.375022 -0.394578 -0.350915 0.216513 0.218491 -0.256576 -0.220578 -0.214113 0.202739 0.181961 -0.199572 0.328048 0.052121 0.085669 -0.122758 0.049630 -0.152465 0.115186 0.494445 0.007859 0.014694 -0.108289 0.072385 0.085557 0.096207 0.097833 0.099390 0.094637 0.097547 0.100847 0.155617 0.110858 0.118979 0.153194 0.106355 0.098491 0.078963 0.093405 0.093151 0.117042 0.092330 0.278438
qa: -0.1725 -0.1793 -0.1783 -0.4970 -0.3190 -0.4675 -0.3750 -0.3946 -0.3509 0.2165 0.2185 -0.2566 -0.2206 -0.2141 0.2027 0.1820 -0.1996 0.3280 0.0521 0.0857 -0.1228 0.0496 -0.1525 0.1152 0.4944 0.0079 0.0147 -0.1083 0.0724 0.0856 0.0962 0.0978 0.0994 0.0946 0.0975 0.1008 0.1556 0.1109 0.1190 0.1532 0.1064 0.0985 0.0790 0.0934 0.0932 0.1170 0.0923 0.2784
va: 1.1313 1.1128 1.1229 1.9819 2.2462 2.0204 1.9172 1.8987 3.0959 3.7103 3.7526 4.0673 3.9434 3.9498 3.9924 3.9783 3.3944 3.8138 3.5186 3.8945 4.0361 3.8416 3.9744 3.8703 4.5123 3.8782 3.9459 3.9011 1.0282 1.0205 1.0172 1.0074 1.0039 1.0115 1.0111 1.0043 1.0039 1.0171 0.9997 1.0055 1.0076 1.0014 1.0048 0.9986 0.9893 0.9913 0.9904 1.0475
dispcorr: -0.026705604 hartree
energy: -1466.685001811595
dipole: 48.23765 -44.74163 3.49601 26.45111 -25.67594 0.77517 3.47837 -4.69236 -1.21399
magnitude: 3.78111 au
magnitude: 9.61081 debye
