program: Orca
programVersion: 5.0.2
elementType: F F F O O O O O N C C C C C C C C C C C C C C C C C C C H H H H H H H H H H H H H H H H H H H H
charge: 0
multiplicity: 1
keywords: wb97x-d3
keywords: def2-TZVPP
keywords: def2/J RIJCOSX
keywords: DEFGRID2
keywords: scfconv7
keywords: smallprint printgap noloewdin
keywords: NOSOSCF
formula: C19H20F3NO5
InChI: InChI=1/C19H20F3NO5/c1-27-6-7-28-9-13-12(4-5-14(23-13)19(20,21)22)18(26)15-16(24)10-2-3-11(8-10)17(15)25/h4-5,10-11,24H,2-3,6-9H2,1H3
48 atoms
F  -4.879367 -2.751434 -0.881202
F  -4.436516 -2.487282 1.208361
F  -5.326504 -0.884903 0.092135
O  1.085288 -2.350811 0.113569
O  3.139682 1.671985 -1.194579
O  0.727943 1.309116 -1.781288
O  0.25304 1.443767 1.369238
O  -0.277426 4.934147 0.76018
N  -2.415983 -0.786552 0.683424
C  3.361021 -1.941947 0.689617
C  4.363042 0.081139 0.060106
C  4.02326 -0.718747 1.313202
C  4.323246 -2.305412 -0.468092
C  5.014817 -0.983924 -0.852969
C  2.018065 -1.560151 0.112928
C  3.092409 0.531988 -0.571821
C  1.93891 -0.239925 -0.507166
C  0.720186 0.306434 -1.056152
C  -0.6098 -0.313988 -0.78475
C  -1.211848 -0.281516 0.477671
C  -1.316889 -0.860332 -1.840766
C  -0.521324 0.31418 1.678062
C  -2.570995 -1.4075 -1.613716
C  -3.063801 -1.349895 -0.325889
C  -4.429429 -1.877453 0.022807
C  -0.506917 2.615231 1.151986
C  0.466809 3.745743 0.889946
C  0.529819 6.034097 0.410038
H  3.218793 -2.77143 1.381869
H  5.011925 0.939953 0.230533
H  3.380333 -0.179728 2.011064
H  4.935992 -1.000542 1.840147
H  5.050911 -3.033306 -0.11033
H  3.802837 -2.766569 -1.307774
H  4.917974 -0.743188 -1.911407
H  6.080711 -1.01913 -0.629017
H  -0.890063 -0.882848 -2.83503
H  -1.274588 0.537267 2.441479
H  0.156773 -0.429045 2.107072
H  -3.127986 -1.849909 -2.426946
H  -1.118933 2.840312 2.034093
H  -1.187947 2.499124 0.29973
H  1.185058 3.820466 1.717474
H  1.044304 3.543926 -0.021606
H  1.307928 6.227697 1.15604
H  1.019651 5.889316 -0.558587
H  -0.10835 6.91387 0.344596
H  2.246154 1.825165 -1.618296
elementType: F O N C H
totalener: -1466.65637993 hartree
nucrepener: 2831.40466561 hartree
electener: -4298.06104554 hartree
oneelecener: -7641.76396125 hartree
twoeener: 3343.70291571 hartree
cpcmener: -0.04403103 hartree
kineticenergy: 1460.83017808 hartree
xcener: -133.538033614065 hartree
chargesum: -0.0000000
charge: -0.177599 -0.173802 -0.178432 -0.496089 -0.313836 -0.464755 -0.374193 -0.395236 -0.344937 0.227469 0.223188 -0.257365 -0.217962 -0.212062 0.170879 0.164064 -0.171526 0.313753 0.027605 0.077253 -0.102942 0.047736 -0.144700 0.112840 0.495199 0.011870 0.046827 -0.115382 0.072770 0.086338 0.095306 0.098479 0.099112 0.093743 0.097281 0.100868 0.156014 0.110771 0.121287 0.152991 0.103629 0.094534 0.079617 0.071072 0.093965 0.095642 0.117705 0.281013
qa: -0.1776 -0.1738 -0.1784 -0.4961 -0.3138 -0.4648 -0.3742 -0.3952 -0.3449 0.2275 0.2232 -0.2574 -0.2180 -0.2121 0.1709 0.1641 -0.1715 0.3138 0.0276 0.0773 -0.1029 0.0477 -0.1447 0.1128 0.4952 0.0119 0.0468 -0.1154 0.0728 0.0863 0.0953 0.0985 0.0991 0.0937 0.0973 0.1009 0.1560 0.1108 0.1213 0.1530 0.1036 0.0945 0.0796 0.0711 0.0940 0.0956 0.1177 0.2810
va: 1.1251 1.1289 1.1153 1.9794 2.2511 2.0214 1.9212 1.9157 3.0982 3.6856 3.7434 4.0661 3.9463 3.9503 4.0081 4.0144 3.3109 3.8673 3.5250 3.8862 4.0190 3.8378 3.9602 3.8645 4.5138 3.8585 3.9088 3.9102 1.0276 1.0205 1.0182 1.0077 1.0038 1.0117 1.0117 1.0043 1.0042 1.0177 0.9947 1.0046 1.0057 0.9994 0.9977 1.0052 0.9878 0.9890 0.9912 1.0397
dispcorr: -0.026709545 hartree
energy: -1466.683089478368
dipole: 47.46015 -43.59215 3.86800 24.76508 -24.07344 0.69164 3.67835 -4.24788 -0.56952
magnitude: 3.97041 au
magnitude: 10.09197 debye
