program: Orca
programVersion: 5.0.2
elementType: F F F O O O O O N C C C C C C C C C C C C C C C C C C C H H H H H H H H H H H H H H H H H H H H
charge: 0
multiplicity: 1
keywords: wb97x-d3
keywords: def2-TZVPP
keywords: def2/J RIJCOSX
keywords: DEFGRID2
keywords: scfconv7
keywords: smallprint printgap noloewdin
keywords: NOSOSCF
formula: C19H20F3NO5
InChI: InChI=1/C19H20F3NO5/c1-27-6-7-28-9-13-12(4-5-14(23-13)19(20,21)22)18(26)15-16(24)10-2-3-11(8-10)17(15)25/h4-5,10-11,24H,2-3,6-9H2,1H3
48 atoms
F  -4.9064 -2.722317 -0.883642
F  -4.448014 -2.488721 1.20606
F  -5.326913 -0.862494 0.115374
O  1.087164 -2.348901 0.117177
O  3.12932 1.673855 -1.21049
O  0.714422 1.309227 -1.780061
O  0.257345 1.430934 1.376811
O  -0.243496 4.911985 0.699324
N  -2.422692 -0.785958 0.686494
C  3.361773 -1.929945 0.692831
C  4.356849 0.093413 0.053051
C  4.015591 -0.699165 1.310542
C  4.331726 -2.297168 -0.456888
C  5.01545 -0.974451 -0.851676
C  2.019295 -1.557497 0.108627
C  3.085689 0.536152 -0.583228
C  1.934994 -0.239587 -0.515483
C  0.712553 0.304345 -1.057843
C  -0.615787 -0.318458 -0.782297
C  -1.216887 -0.28503 0.480619
C  -1.325358 -0.86302 -1.837784
C  -0.52776 0.308597 1.682846
C  -2.581281 -1.405915 -1.610474
C  -3.073329 -1.34607 -0.322551
C  -4.441774 -1.864228 0.027962
C  -0.492401 2.60204 1.123872
C  0.49439 3.730942 0.907094
C  0.58565 6.018854 0.430912
H  3.21999 -2.754918 1.390599
H  5.001571 0.956044 0.220097
H  3.366793 -0.157987 2.001265
H  4.927207 -0.972497 1.843877
H  5.063367 -3.015157 -0.087355
H  3.819493 -2.771513 -1.294234
H  4.916686 -0.741998 -1.911818
H  6.081629 -1.001485 -0.628027
H  -0.899663 -0.885947 -2.832506
H  -1.284461 0.539912 2.440581
H  0.141905 -0.438748 2.117866
H  -3.140362 -1.84549 -2.423778
H  -1.146149 2.828298 1.975907
H  -1.13231 2.485516 0.239698
H  1.150524 3.827558 1.783364
H  1.137527 3.511421 0.043989
H  1.17683 5.876281 -0.48123
H  -0.051727 6.892299 0.295419
H  1.279289 6.221777 1.255406
H  2.234031 1.824405 -1.631577
elementType: F O N C H
totalener: -1466.65639750 hartree
nucrepener: 2832.82344493 hartree
electener: -4299.47984244 hartree
oneelecener: -7644.60992341 hartree
twoeener: 3345.13008097 hartree
cpcmener: -0.04402225 hartree
kineticenergy: 1460.82385745 hartree
xcener: -133.536725190259 hartree
chargesum: 0.0000000
charge: -0.177536 -0.173955 -0.178283 -0.496044 -0.314080 -0.464236 -0.374824 -0.394327 -0.345779 0.226227 0.223910 -0.256357 -0.217589 -0.212473 0.172252 0.162918 -0.168539 0.310527 0.023389 0.083761 -0.101826 0.045497 -0.145068 0.112960 0.495254 0.012165 0.043146 -0.115356 0.072764 0.086205 0.095163 0.098428 0.099217 0.093588 0.097186 0.100819 0.155864 0.111119 0.121347 0.153007 0.106484 0.092718 0.080691 0.071801 0.095153 0.117804 0.093912 0.280995
qa: -0.1775 -0.1740 -0.1783 -0.4960 -0.3141 -0.4642 -0.3748 -0.3943 -0.3458 0.2262 0.2239 -0.2564 -0.2176 -0.2125 0.1723 0.1629 -0.1685 0.3105 0.0234 0.0838 -0.1018 0.0455 -0.1451 0.1130 0.4953 0.0122 0.0431 -0.1154 0.0728 0.0862 0.0952 0.0984 0.0992 0.0936 0.0972 0.1008 0.1559 0.1111 0.1213 0.1530 0.1065 0.0927 0.0807 0.0718 0.0952 0.1178 0.0939 0.2810
va: 1.1253 1.1288 1.1157 1.9798 2.2510 2.0219 1.9186 1.9157 3.0990 3.6872 3.7432 4.0653 3.9458 3.9512 4.0089 4.0139 3.3138 3.8691 3.5238 3.8775 4.0187 3.8377 3.9593 3.8639 4.5144 3.8506 3.9114 3.9099 1.0276 1.0205 1.0185 1.0077 1.0037 1.0117 1.0117 1.0043 1.0042 1.0178 0.9950 1.0046 1.0051 1.0015 0.9974 1.0052 0.9886 0.9912 0.9884 1.0396
dispcorr: -0.026772281 hartree
energy: -1466.683169782903
dipole: 47.69957 -43.82258 3.87699 24.70186 -23.99907 0.70279 3.83333 -4.35120 -0.51788
magnitude: 3.97406 au
magnitude: 10.10127 debye
