program: Orca
programVersion: 5.0.2
elementType: F F F O O O O O N C C C C C C C C C C C C C C C C C C C H H H H H H H H H H H H H H H H H H H H
charge: 0
multiplicity: 1
keywords: wb97x-d3
keywords: def2-TZVPP
keywords: def2/J RIJCOSX
keywords: DEFGRID2
keywords: scfconv7
keywords: smallprint printgap noloewdin
keywords: NOSOSCF
formula: C19H20F3NO5
InChI: InChI=1/C19H20F3NO5/c1-27-6-7-28-9-13-12(4-5-14(23-13)19(20,21)22)18(26)15-16(24)10-2-3-11(8-10)17(15)25/h4-5,10-11,24H,2-3,6-9H2,1H3
48 atoms
F  -5.154415 -2.261378 1.049307
F  -5.136489 -1.085391 -0.751551
F  -4.234388 -3.033453 -0.736276
O  1.033902 -2.380205 0.045202
O  3.148711 1.556242 1.511276
O  0.694456 1.315496 1.891992
O  0.397925 1.277836 -1.313015
O  0.112688 4.783882 -0.642689
N  -2.392938 -0.824586 -0.619029
C  3.314587 -1.979561 -0.530523
C  4.380522 -0.053514 0.289261
C  4.451734 -1.572155 0.402064
C  3.537392 -1.074774 -1.767223
C  4.281213 0.167018 -1.239243
C  1.992042 -1.623434 0.101429
C  3.104918 0.411727 0.898977
C  1.929248 -0.316488 0.753446
C  0.698332 0.284098 1.205478
C  -0.634735 -0.310666 0.892807
C  -1.190589 -0.324563 -0.39179
C  -1.395202 -0.789343 1.944743
C  -0.458116 0.203695 -1.599108
C  -2.651496 -1.323778 1.697868
C  -3.090512 -1.32591 0.390611
C  -4.412429 -1.92471 -0.007352
C  -0.274149 2.502497 -1.097992
C  0.780271 3.569495 -0.889545
C  1.005583 5.849507 -0.416861
H  3.312037 -3.039066 -0.784599
H  5.221739 0.472737 0.739089
H  4.334924 -1.938086 1.42331
H  5.408452 -1.933141 0.021142
H  4.145999 -1.611088 -2.49458
H  2.601089 -0.82024 -2.265385
H  3.780679 1.101327 -1.494147
H  5.290939 0.222699 -1.64515
H  -1.008498 -0.770567 2.955238
H  0.160918 -0.594998 -2.018094
H  -1.195871 0.46894 -2.364776
H  -3.245323 -1.715545 2.510695
H  -0.932272 2.449241 -0.221194
H  -0.901283 2.751847 -1.963559
H  1.430813 3.301567 -0.046851
H  1.419243 3.645913 -1.779686
H  1.635835 5.676574 0.46184
H  1.662428 6.02351 -1.27571
H  0.418242 6.750596 -0.246566
H  2.222505 1.759297 1.838555
elementType: F O N C H
totalener: -1466.65639488 hartree
nucrepener: 2856.91784414 hartree
electener: -4323.57423903 hartree
oneelecener: -7692.74469588 hartree
twoeener: 3369.17045685 hartree
cpcmener: -0.04400157 hartree
kineticenergy: 1460.83118124 hartree
xcener: -133.539453401850 hartree
chargesum: -0.0000000
charge: -0.176956 -0.174970 -0.177453 -0.488051 -0.312317 -0.468084 -0.375869 -0.394947 -0.348457 0.255031 0.226480 -0.267736 -0.233491 -0.207927 0.152589 0.172732 -0.200104 0.346889 0.020134 0.100234 -0.108068 0.033708 -0.144185 0.108296 0.494103 0.008809 0.038418 -0.114862 0.069009 0.082580 0.099067 0.098201 0.101209 0.098308 0.093970 0.102031 0.155472 0.125235 0.113822 0.152936 0.090615 0.109098 0.073277 0.083904 0.094977 0.094015 0.117919 0.280408
qa: -0.1770 -0.1750 -0.1775 -0.4881 -0.3123 -0.4681 -0.3759 -0.3949 -0.3485 0.2550 0.2265 -0.2677 -0.2335 -0.2079 0.1526 0.1727 -0.2001 0.3469 0.0201 0.1002 -0.1081 0.0337 -0.1442 0.1083 0.4941 0.0088 0.0384 -0.1149 0.0690 0.0826 0.0991 0.0982 0.1012 0.0983 0.0940 0.1020 0.1555 0.1252 0.1138 0.1529 0.0906 0.1091 0.0733 0.0839 0.0950 0.0940 0.1179 0.2804
va: 1.1259 1.1269 1.1192 1.9890 2.2522 2.0198 1.9142 1.9179 3.1081 3.6209 3.7402 4.0797 3.9376 3.9449 4.0298 3.9835 3.3026 3.8292 3.5195 3.8388 4.0212 3.8348 3.9458 3.8746 4.5172 3.8490 3.9139 3.9093 1.0261 1.0205 1.0127 1.0077 1.0071 1.0150 1.0182 1.0066 1.0050 0.9916 1.0181 1.0044 1.0045 1.0048 1.0047 0.9972 0.9885 0.9889 0.9912 1.0425
dispcorr: -0.027820536 hartree
energy: -1466.684215417666
dipole: 47.18211 -43.39742 3.78470 26.87718 -26.01653 0.86065 -7.92446 8.28424 0.35977
magnitude: 3.89796 au
magnitude: 9.90782 debye
