program: Gaussian 09
title: 000002181
version: EM64L-G09RevD.01
frameworkgroup: C1[X(C10H14N2)]
method: RPBEPBE
basis: SDD
operation: Freq
keyword: #pfreq=noraman
keyword: PBEPBE/SDD
title: #p freq=noraman PBEPBE/SDD
converged: YES YES NO NO
title: Mulliken charges:
elementType: N N C C C C C C C C C C H H H H H H H H H H H H H H
charge: -0.266636 -0.003789 -0.180338 -0.407135 -0.424138 -0.371967 -0.461047 0.381023 -0.343511 -0.465605 -0.204444 -0.342794 0.216475 0.197594 0.193313 0.195678 0.216137 0.195420 0.197881 0.224284 0.206116 0.248146 0.253498 0.280027 0.226582 0.239230
chargesum: 0.00000
title: Mulliken charges with hydrogens summed into heavy atoms:
elementType: N N C C C C C C C C C C
charge: -0.018490 -0.003789 0.036137 -0.016228 -0.012322 0.021334 -0.030647 0.381023 -0.090013 -0.185578 0.022137 -0.103565
polarizability: 1.54903495e+02 -3.64067079e+00 1.12952671e+02 5.44080326e+00 -4.68586844e+00 7.61238909e+01
1716.lowfreq: -17.5165 -2.5785 -0.0005 -0.0002 0.0005 6.2525 34.6595 83.8892 132.9495
frequency: 33.9177 83.8823 132.9478 201.5638 235.5230 282.5403 315.2946 364.3289 396.3765 431.2051 443.9202 489.2162 525.2569 610.1223 655.9202 664.4151 724.2547 777.0626 807.3123 826.0508 836.6454 884.5433 904.4343 927.4793 931.3577 951.0603 980.2890 986.0770 1009.5951 1031.3048 1047.7685 1072.3666 1100.5027 1109.7299 1131.5975 1148.3121 1192.2428 1200.0160 1212.4654 1245.5324 1260.2016 1295.5536 1311.9143 1321.2418 1323.2091 1336.6654 1337.9973 1341.0322 1352.6038 1408.0328 1439.0056 1453.0006 1453.8878 1458.7632 1461.0091 1470.4181 1557.0988 1586.8346 2929.1908 2961.0326 2966.1661 2967.5463 2972.8129 3024.3066 3029.3377 3038.3565 3051.6709 3127.2459 3144.4005 3146.4765 3165.4289 3417.0325
redmass: 3.7006 3.5231 4.0168 2.9971 1.8799 5.2406 2.0390 2.8889 3.1778 2.6820 3.5247 2.6590 1.8137 7.0912 4.0412 1.8130 1.9416 2.2205 1.6119 2.5581 1.9706 1.8187 1.8064 2.1778 1.3519 1.4817 2.4612 1.4072 3.4597 2.7795 2.1854 1.6417 1.8354 2.3592 1.6917 1.8547 1.4974 1.6131 1.4685 1.3701 1.3843 1.5496 3.4965 1.3131 1.4123 1.4121 1.2910 1.3121 1.3949 2.1734 1.1350 2.1598 1.0886 1.1227 1.0890 1.0927 5.5147 5.6550 1.0812 1.0596 1.0617 1.0649 1.0640 1.0997 1.0972 1.1018 1.1022 1.0872 1.0908 1.0922 1.0997 1.0743
irintensity: 0.7329 0.3023 0.1225 0.5791 4.7699 0.4384 0.5255 1.7078 2.2671 5.1328 2.1904 5.3388 5.5444 2.9378 3.2872 114.3039 41.2862 12.9347 17.2608 5.7514 24.5855 9.9720 5.2719 0.7222 0.9622 1.9234 15.4758 0.4426 6.3303 1.1850 3.9658 10.1224 2.5906 9.1636 6.3010 17.4553 2.0352 7.6529 7.0670 3.1695 8.7019 1.0351 1.6148 1.5030 6.1252 3.2402 0.6229 8.7783 0.7190 23.4667 24.9578 23.2811 9.2303 1.6222 10.5631 8.3164 10.3978 0.2094 17.2615 44.5112 33.5032 32.2478 39.7402 49.6251 68.3516 62.8106 60.8691 7.2619 30.8763 4.9341 22.4384 0.8129
temp: 298.150 k
press: 1.00000 atm
elementType: 7 7 6 6 6 6 6 6 6 6 6 6 1 1 1 1 1 1 1 1 1 1 1 1 1 1
symmnumber: 1
zpe: 586253.3 jmol-1
zpe.correction: 0.223292 hartree
zpe.thermalcorrener: 0.233562 hartree
zpe.thermalcorrenthalpy: 0.234507 hartree
zpe.thermalcorrgfe: 0.186927 hartree
zpe.sumelectzpe: -498.046053 hartree
zpe.sumelectthermal: -498.035783 hartree
zpe.sumelectthermalent: -498.034839 hartree
zpe.sumelectthermalfe: -498.082418 hartree
dipole: 2.7144 3.0391 -0.7436
dipole: 4.1422
quadrupole: -71.8602 -74.7143 -71.8481
quadrupole: -8.6864 1.8902 0.0505
quadrupole: 0.9473 -1.9068 0.9594 -8.6864 1.8902 0.0505
hfenergy: -498.2693455 hartree
pointgroup: C01 [X(C10H14N2)]
dipole: 1.0780326 1.2017435 -0.2222904 debye
dipolederiv: -0.8018854 -0.0561649 -0.0256611 -0.1222873 -0.6207904 -0.1168911 0.01655 -0.0078707 -0.128862 -0.3886855 -0.0100606 -0.010221 -0.028965 -0.3153932 0.0120437 0.0008364 0.0139418 -0.2522223 0.3491698 -0.0250831 -0.0768905 0.057423 0.3931081 0.0790474 -0.2582982 0.1241151 0.2892867 -0.1061224 -0.0424571 -0.0110566 0.0200879 -0.0616066 -0.0034345 0.042827 -0.0147177 0.1331248 0.0774902 0.0274786 0.0043051 -0.0110493 0.0751676 -0.0428199 0.0353589 -0.0115604 0.1510041 -0.0656611 -0.0271426 0.0288107 -0.0670011 -0.0545412 -0.0225607 -0.0062472 0.0024887 0.1263743 0.5529664 -0.0002893 0.0391423 -0.0055755 0.2964748 -0.0271726 0.1576817 -0.1007659 0.2228148 0.1821183 -0.0567241 0.0739986 0.0332431 -0.2526146 0.0231866 0.1126581 0.0067437 0.0057245 0.0166183 0.0270076 0.0299449 0.0585259 0.0984745 -0.0314974 0.0097296 -0.0299352 -0.1107806 0.0350698 0.005906 0.0116066 -0.1629512 0.2598768 -0.1016862 0.0199479 -0.0570869 -0.0520588 -0.2048742 -0.0553781 0.0071424 -0.2243875 0.0057322 -0.0652417 0.0255351 -0.0317895 -0.1003836 0.3211679 -0.0360603 0.0892413 0.1594639 0.0891749 -0.0113049 0.0361642 -0.0429585 -0.0727805 -0.0264397 0.0038895 -0.0659701 0.0088203 0.0101441 0.0440704 -0.0023878 0.0116841 -0.1428987 0.0138198 0.0942018 0.0583134 0.1112029 -0.1055625 -0.0937412 0.0762073 -0.1029618 0.0001266 0.0352534 0.0065353 -0.0378524 -0.0170413 0.0399777 0.03243 -0.058433 0.0753474 -0.1524784 0.0345153 0.0188994 0.0078157 0.0523767 0.0592745 0.0693593 -0.0427914 0.0040601 -0.1864812 -0.0534994 -0.1072558 0.0065473 -0.1324979 -0.1473775 0.0076276 0.0314054 0.0368954 0.0718672 0.0924869 0.0007018 -0.029459 -0.0120501 0.0123584 0.0438307 0.041207 0.0347986 -0.1889597 -0.2655517 0.0444657 -0.0420301 0.0222004 0.0539655 0.0003139 -0.0826151 0.0030786 0.065662 -0.0347801 0.0641952 0.0293064 0.0790923 -0.10815 -0.0939558 0.0763281 -0.1340484 0.0183063 0.0000722 -0.0157761 -0.000922 -0.034566 0.0538387 0.0344771 -0.0765672 0.1066332 -0.1648909 0.1812723 0.0811454 0.0370696 0.1291479 0.2084305 0.138743 -0.0316378 0.0021914 -0.0260938 0.0869903 -0.0968414 0.0063266 -0.1055711 -0.0370575 0.0145392 0.0142289 0.0118443 0.1251341 0.0875752 0.0597041 -0.0352765 0.0916913 0.0102473 0.0392453 -0.0330455 0.0290869 0.104668 0.0194018 0.0769906 -0.0393708 0.107712 -0.0520738 0.0626343 -0.0483984 0.0579994 0.1375677 -0.1384885 0.0181125 -0.0548606 -0.0070445 0.0889218 0.0087571 -0.0562439 0.0127862 0.1272297 unknown
polarizability: 154.032322|-3.2495291|112.9847791|9.9818936|-4.6187309|76.9629555 unknown
InChI: InChI=1S/C10H14N2/c1-2-7-12-10(5-1)9-4-3-6-11-8-9/h3-4,6,8,10,12H,1-2,5,7H2
charge 0 multiplicity 1
26 atoms
N  1.349552 -1.178213 -0.309966
N  -2.866911 -1.257342 -0.053732
C  0.73236 -0.026788 0.413761
C  1.491969 1.308819 0.172414
C  2.996647 1.140549 0.500675
C  3.619405 -0.043147 -0.278376
C  2.798038 -1.33573 -0.027764
C  -0.763092 0.018549 0.093787
C  -1.453032 1.195531 -0.283984
C  -1.526441 -1.178667 0.188567
C  -2.842137 1.135773 -0.544428
C  -3.50631 -0.102918 -0.415938
H  0.838551 -0.265345 1.496274
H  1.062245 2.116172 0.79826
H  1.373198 1.612077 -0.888777
H  3.111094 0.956015 1.589515
H  3.539474 2.078894 0.278832
H  3.623217 0.184735 -1.364286
H  4.673016 -0.195285 0.028256
H  3.180999 -2.173387 -0.638842
H  2.90327 -1.631537 1.035968
H  1.160838 -1.115553 -1.321764
H  -0.922584 2.148677 -0.374721
H  -1.024282 -2.113505 0.459516
H  -3.399709 2.030784 -0.839316
H  -4.582573 -0.191159 -0.604431
