program: Orca
programVersion: 5.0.2
elementType: F F F O O O O O N C C C C C C C C C C C C C C C C C C C H H H H H H H H H H H H H H H H H H H H
charge: 0
multiplicity: 1
keywords: wb97x-d3
keywords: def2-TZVPP
keywords: def2/J RIJCOSX
keywords: DEFGRID2
keywords: scfconv7
keywords: smallprint printgap noloewdin
keywords: NOSOSCF
formula: C19H20F3NO5
InChI: InChI=1/C19H20F3NO5/c1-27-6-7-28-9-13-12(4-5-14(23-13)19(20,21)22)18(26)15-16(24)10-2-3-11(8-10)17(15)25/h4-5,10-11,24H,2-3,6-9H2,1H3
48 atoms
F  -5.339447 -0.990636 -1.264259
F  -4.779461 -2.997438 -0.728122
F  -4.901756 -1.472206 0.782536
O  3.362795 0.7491 -2.139278
O  0.900088 -1.473827 1.199341
O  0.912749 0.697263 -2.374457
O  -0.185711 2.207877 0.021628
O  1.136887 3.95331 1.934951
N  -2.831952 -0.059352 -0.57099
C  4.485358 -0.334012 -0.362358
C  3.274785 -1.492388 1.274531
C  4.329943 -1.741205 0.204476
C  4.586294 0.545455 0.910375
C  3.818854 -0.236968 1.992396
C  3.231121 0.016329 -1.080186
C  1.942006 -1.157121 0.644112
C  1.984787 -0.399883 -0.607594
C  0.818664 -0.014183 -1.361626
C  -0.546688 -0.509314 -1.030635
C  -1.593063 0.372367 -0.744245
C  -0.829088 -1.859034 -1.149804
C  -1.38254 1.861762 -0.6238
C  -2.131938 -2.301963 -0.987873
C  -3.090348 -1.351534 -0.700061
C  -4.532975 -1.710615 -0.480311
C  -0.20643 1.966502 1.416666
C  1.042104 2.549346 2.034695
C  0.289232 4.643138 2.826548
H  5.336713 -0.204871 -1.029736
H  3.131535 -2.327926 1.959401
H  4.03683 -2.480065 -0.542918
H  5.265786 -2.071027 0.658205
H  5.63756 0.657408 1.173368
H  4.18893 1.548699 0.751935
H  3.029986 0.35031 2.46222
H  4.493032 -0.555636 2.787209
H  -0.044336 -2.566463 -1.383353
H  -1.345895 2.302383 -1.623432
H  -2.252934 2.291477 -0.114849
H  -2.365973 -3.351955 -1.083806
H  -0.227915 0.893412 1.638452
H  -1.111393 2.397257 1.864509
H  1.085261 2.224857 3.082664
H  1.923069 2.140321 1.532778
H  0.447101 4.325908 3.863433
H  0.52392 5.704361 2.753538
H  -0.772739 4.516701 2.592501
H  2.432604 0.931953 -2.490255
elementType: F O N C H
totalener: -1466.65758625 hartree
nucrepener: 2851.81074927 hartree
electener: -4318.46833552 hartree
oneelecener: -7682.49036540 hartree
twoeener: 3364.02202988 hartree
cpcmener: -0.04846844 hartree
kineticenergy: 1460.85215250 hartree
xcener: -133.545048425640 hartree
chargesum: 0.0000000
charge: -0.176098 -0.177429 -0.176987 -0.312205 -0.496326 -0.459658 -0.380026 -0.408175 -0.351842 0.230447 0.257184 -0.266882 -0.236067 -0.245310 0.212586 0.184003 -0.250530 0.359674 0.011383 0.111401 -0.144367 0.031611 -0.108939 0.101620 0.494956 -0.000614 0.034837 -0.107562 0.084368 0.073727 0.097062 0.098141 0.105731 0.103413 0.100497 0.106419 0.165092 0.122470 0.103064 0.151944 0.101826 0.111222 0.088882 0.075334 0.093977 0.117507 0.095215 0.273423
qa: -0.1761 -0.1774 -0.1770 -0.3122 -0.4963 -0.4597 -0.3800 -0.4082 -0.3518 0.2304 0.2572 -0.2669 -0.2361 -0.2453 0.2126 0.1840 -0.2505 0.3597 0.0114 0.1114 -0.1444 0.0316 -0.1089 0.1016 0.4950 -0.0006 0.0348 -0.1076 0.0844 0.0737 0.0971 0.0981 0.1057 0.1034 0.1005 0.1064 0.1651 0.1225 0.1031 0.1519 0.1018 0.1112 0.0889 0.0753 0.0940 0.1175 0.0952 0.2734
va: 1.1254 1.1257 1.1212 2.2511 1.9682 2.0461 1.9160 1.9057 3.0986 3.7200 3.6718 4.0770 3.9666 3.9341 3.9553 3.9695 3.3406 3.8300 3.5514 3.8620 3.9758 3.8256 3.9302 3.8843 4.5219 3.8044 3.9967 3.9013 1.0211 1.0258 1.0139 1.0070 1.0067 1.0043 1.0152 1.0053 0.9946 1.0016 1.0212 1.0040 1.0045 0.9979 0.9989 0.9939 0.9920 0.9912 0.9835 1.0597
dispcorr: -0.027581562 hartree
energy: -1466.685167809189
dipole: 45.63042 -42.33607 3.29436 20.98021 -22.08591 -1.10570 19.08883 -18.25337 0.83546
magnitude: 3.57398 au
magnitude: 9.08434 debye
