program: Orca
programVersion: 5.0.2
elementType: F F F O O O O O N C C C C C C C C C C C C C C C C C C C H H H H H H H H H H H H H H H H H H H H
charge: 0
multiplicity: 1
keywords: wb97x-d3
keywords: def2-TZVPP
keywords: def2/J RIJCOSX
keywords: DEFGRID2
keywords: scfconv7
keywords: smallprint printgap noloewdin
keywords: NOSOSCF
formula: C19H20F3NO5
InChI: InChI=1/C19H20F3NO5/c1-27-6-7-28-9-13-12(4-5-14(23-13)19(20,21)22)18(26)15-16(24)10-2-3-11(8-10)17(15)25/h4-5,10-11,24H,2-3,6-9H2,1H3
48 atoms
F  -4.797157 -2.789803 -1.167175
F  -4.626187 -1.909311 0.787555
F  -5.314269 -0.724241 -0.865564
O  3.489517 0.763559 -2.149877
O  0.881467 -1.564509 1.001051
O  1.0177 0.790705 -2.4283
O  0.08579 2.014343 0.215833
O  0.631514 3.969608 2.241175
N  -2.717599 -0.02994 -0.492615
C  4.537455 -0.428419 -0.395784
C  3.253756 -1.620143 1.161399
C  4.334209 -1.851825 0.112397
C  4.62836 0.395874 0.913376
C  3.796687 -0.398256 1.937797
C  3.310209 -0.015313 -1.12816
C  1.948607 -1.238153 0.502198
C  2.046206 -0.421314 -0.706859
C  0.899611 0.034025 -1.45435
C  -0.476266 -0.457219 -1.15287
C  -1.475072 0.391968 -0.671986
C  -0.810761 -1.760019 -1.476485
C  -1.189645 1.837015 -0.348562
C  -2.115953 -2.190308 -1.307394
C  -3.024893 -1.279185 -0.805597
C  -4.447727 -1.676093 -0.519429
C  0.157893 1.72392 1.601687
C  -0.249478 2.892787 2.465894
C  0.296365 5.102848 3.007321
H  5.409165 -0.295706 -1.035774
H  3.075559 -2.476135 1.811964
H  4.046662 -2.555304 -0.670357
H  5.249153 -2.219822 0.579082
H  5.673912 0.45393 1.214083
H  4.276616 1.419296 0.783788
H  3.001807 0.195776 2.388806
H  4.426732 -0.754022 2.752814
H  -0.061848 -2.439882 -1.861806
H  -1.217034 2.422864 -1.271317
H  -1.989221 2.221541 0.29247
H  -2.389868 -3.205207 -1.555466
H  1.195825 1.455526 1.812422
H  -0.460587 0.860089 1.868236
H  -1.288206 3.189361 2.261178
H  -0.21754 2.565975 3.514685
H  1.021748 5.885778 2.787949
H  -0.70374 5.481075 2.76586
H  0.327774 4.895771 4.083308
H  2.582447 0.991032 -2.517971
elementType: F O N C H
totalener: -1466.65752554 hartree
nucrepener: 2835.20346473 hartree
electener: -4301.86099027 hartree
oneelecener: -7649.96295873 hartree
twoeener: 3348.10196846 hartree
cpcmener: -0.04841424 hartree
kineticenergy: 1460.84176282 hartree
xcener: -133.541529586511 hartree
chargesum: 0.0000000
charge: -0.177812 -0.178405 -0.174089 -0.309781 -0.493204 -0.463285 -0.390236 -0.396291 -0.349106 0.212139 0.261655 -0.263804 -0.209909 -0.247199 0.211594 0.152553 -0.251591 0.372498 0.042388 0.089206 -0.148334 0.043855 -0.116236 0.105018 0.494646 0.060533 0.007222 -0.113093 0.084313 0.073310 0.097394 0.098074 0.100933 0.097541 0.105414 0.106039 0.161922 0.118771 0.107799 0.150361 0.077026 0.094240 0.087163 0.092219 0.117214 0.094153 0.092451 0.272732
qa: -0.1778 -0.1784 -0.1741 -0.3098 -0.4932 -0.4633 -0.3902 -0.3963 -0.3491 0.2121 0.2617 -0.2638 -0.2099 -0.2472 0.2116 0.1526 -0.2516 0.3725 0.0424 0.0892 -0.1483 0.0439 -0.1162 0.1050 0.4946 0.0605 0.0072 -0.1131 0.0843 0.0733 0.0974 0.0981 0.1009 0.0975 0.1054 0.1060 0.1619 0.1188 0.1078 0.1504 0.0770 0.0942 0.0872 0.0922 0.1172 0.0942 0.0925 0.2727
va: 1.1243 1.1152 1.1292 2.2534 1.9742 2.0401 1.9172 1.8995 3.0935 3.7474 3.6484 4.0715 3.9536 3.9317 3.9660 4.0115 3.3386 3.8360 3.5572 3.9323 3.9976 3.8371 3.9453 3.8771 4.5156 3.8845 3.9816 3.9069 1.0215 1.0256 1.0138 1.0071 1.0060 1.0113 1.0102 1.0036 0.9953 1.0009 1.0159 1.0053 1.0099 1.0008 0.9925 0.9979 0.9911 0.9900 0.9887 1.0556
dispcorr: -0.026526213 hartree
energy: -1466.684051748325
dipole: 43.83206 -40.68642 3.14564 22.13265 -22.74749 -0.61484 20.20247 -19.44096 0.76151
magnitude: 3.29439 au
magnitude: 8.37368 debye
