program: Orca
programVersion: 5.0.2
elementType: F F F O O O O O N C C C C C C C C C C C C C C C C C C C H H H H H H H H H H H H H H H H H H H H
charge: 0
multiplicity: 1
keywords: wb97x-d3
keywords: def2-TZVPP
keywords: def2/J RIJCOSX
keywords: DEFGRID2
keywords: scfconv7
keywords: smallprint printgap noloewdin
keywords: NOSOSCF
formula: C19H20F3NO5
InChI: InChI=1/C19H20F3NO5/c1-27-6-7-28-9-13-12(4-5-14(23-13)19(20,21)22)18(26)15-16(24)10-2-3-11(8-10)17(15)25/h4-5,10-11,24H,2-3,6-9H2,1H3
48 atoms
F  -4.756759 -3.097214 -0.792325
F  -5.119003 -1.736642 0.833874
F  -5.462854 -1.102802 -1.190611
O  2.987628 1.375455 -1.917083
O  0.831342 -1.482165 1.127038
O  0.47312 1.523919 -1.672998
O  -0.223663 1.637561 1.315609
O  2.288608 2.981822 0.831221
N  -2.983574 -0.228802 0.199497
C  4.244618 -0.245551 -0.734319
C  3.184536 -1.67377 0.793515
C  4.013544 -1.732101 -0.484824
C  4.690246 0.261782 0.657692
C  3.957334 -0.649222 1.660834
C  2.93791 0.380409 -1.081211
C  1.811796 -1.119634 0.493568
C  1.750423 -0.079749 -0.530683
C  0.506686 0.514662 -0.960515
C  -0.789161 -0.182467 -0.705593
C  -1.790576 0.336411 0.116122
C  -1.054819 -1.336826 -1.422454
C  -1.576369 1.561365 0.954377
C  -2.304382 -1.927843 -1.330454
C  -3.233596 -1.316431 -0.511972
C  -4.645413 -1.822893 -0.408285
C  0.11277 2.848599 1.959473
C  1.615895 2.958453 2.069148
C  2.060287 4.14243 0.064359
H  4.974671 -0.023871 -1.512635
H  3.071233 -2.63534 1.293779
H  3.511807 -2.237824 -1.31125
H  4.964075 -2.237091 -0.306558
H  5.770447 0.139681 0.734451
H  4.477217 1.319102 0.806719
H  3.29776 -0.09308 2.32872
H  4.668548 -1.181609 2.291903
H  -0.294348 -1.773371 -2.057556
H  -1.881888 2.449268 0.382137
H  -2.228869 1.511488 1.833708
H  -2.527001 -2.826152 -1.88785
H  -0.308912 2.882707 2.972074
H  -0.306669 3.703545 1.413936
H  1.843525 3.85634 2.658409
H  2.011164 2.099692 2.617744
H  2.225543 5.054165 0.649069
H  2.767906 4.13644 -0.763761
H  1.050286 4.186362 -0.35407
H  2.062425 1.729516 -2.031292
elementType: F O N C H
totalener: -1466.65744343 hartree
nucrepener: 2893.35174593 hartree
electener: -4360.00918936 hartree
oneelecener: -7767.44561185 hartree
twoeener: 3407.43642249 hartree
cpcmener: -0.04905959 hartree
kineticenergy: 1460.84812233 hartree
xcener: -133.543933255775 hartree
chargesum: -0.0000000
charge: -0.177903 -0.173072 -0.179257 -0.311786 -0.500664 -0.472747 -0.350599 -0.383639 -0.355831 0.252650 0.235343 -0.263724 -0.231187 -0.234947 0.162405 0.214469 -0.296551 0.430085 0.045184 0.132629 -0.155144 -0.026732 -0.114569 0.103582 0.496286 0.001777 0.013051 -0.130980 0.086011 0.073782 0.096926 0.097276 0.103284 0.093844 0.098827 0.103415 0.158369 0.117347 0.099822 0.152752 0.100565 0.092531 0.102068 0.093111 0.111421 0.110761 0.100367 0.279393
qa: -0.1779 -0.1731 -0.1793 -0.3118 -0.5007 -0.4727 -0.3506 -0.3836 -0.3558 0.2527 0.2353 -0.2637 -0.2312 -0.2349 0.1624 0.2145 -0.2966 0.4301 0.0452 0.1326 -0.1551 -0.0267 -0.1146 0.1036 0.4963 0.0018 0.0131 -0.1310 0.0860 0.0738 0.0969 0.0973 0.1033 0.0938 0.0988 0.1034 0.1584 0.1173 0.0998 0.1528 0.1006 0.0925 0.1021 0.0931 0.1114 0.1108 0.1004 0.2794
va: 1.1245 1.1301 1.1133 2.2527 1.9743 2.0167 1.9686 1.8977 3.0984 3.6905 3.6787 4.0732 3.9245 3.9427 3.9455 3.9839 3.3904 3.7528 3.5907 3.9667 4.0135 4.0065 3.9324 3.8745 4.5081 3.8763 3.9068 3.9006 1.0180 1.0264 1.0145 1.0072 1.0074 1.0379 1.0116 1.0056 0.9971 0.9941 1.0085 1.0041 1.0004 0.9881 1.0039 0.9985 0.9967 0.9939 0.9799 1.0383
dispcorr: -0.029163807 hartree
energy: -1466.686607238154
dipole: 51.25743 -47.79603 3.46140 23.93241 -23.02310 0.90931 10.49974 -10.93187 -0.43213
magnitude: 3.60484 au
magnitude: 9.16277 debye
