program: Orca
programVersion: 5.0.2
elementType: F F F O O O O O N C C C C C C C C C C C C C C C C C C C H H H H H H H H H H H H H H H H H H H H
charge: 0
multiplicity: 1
keywords: wb97x-d3
keywords: def2-TZVPP
keywords: def2/J RIJCOSX
keywords: DEFGRID2
keywords: scfconv7
keywords: smallprint printgap noloewdin
keywords: NOSOSCF
formula: C19H20F3NO5
InChI: InChI=1/C19H20F3NO5/c1-27-6-7-28-9-13-12(4-5-14(23-13)19(20,21)22)18(26)15-16(24)10-2-3-11(8-10)17(15)25/h4-5,10-11,24H,2-3,6-9H2,1H3
48 atoms
F  -5.278863 -2.334729 -1.117704
F  -4.341715 -3.084291 0.668858
F  -5.312069 -1.168383 0.688604
O  3.033293 1.380775 -1.795445
O  0.736742 -2.00094 0.53521
O  0.570235 1.222722 -2.088009
O  -0.277984 1.89889 0.827717
O  2.155989 3.385938 0.510518
N  -2.695143 -0.582111 0.490492
C  4.217073 -0.042647 -0.322494
C  3.070097 -1.686933 0.897207
C  4.170394 -1.557369 -0.151967
C  4.250041 0.454121 1.141009
C  3.440651 -0.593359 1.928331
C  2.941202 0.402109 -0.949545
C  1.73684 -1.34856 0.27579
C  1.724776 -0.196039 -0.626441
C  0.524785 0.327791 -1.233402
C  -0.819399 -0.25174 -0.929323
C  -1.510237 -0.040263 0.268591
C  -1.433316 -1.00037 -1.918102
C  -0.952779 0.798462 1.379222
C  -2.676412 -1.567485 -1.679459
C  -3.250724 -1.33643 -0.445973
C  -4.55569 -1.975894 -0.054082
C  0.269844 2.747677 1.814254
C  1.005621 3.880862 1.153697
C  2.901024 4.396242 -0.126211
H  5.060744 0.319777 -0.909183
H  3.0054 -2.677974 1.345211
H  3.960982 -2.095099 -1.078021
H  5.121252 -1.920217 0.241386
H  5.289207 0.473963 1.468655
H  3.85956 1.464424 1.251457
H  2.559862 -0.165283 2.409748
H  4.045781 -1.037585 2.717966
H  -0.940234 -1.165777 -2.867357
H  -1.776023 1.116794 2.0289
H  -0.277049 0.190507 1.998789
H  -3.156934 -2.165815 -2.440039
H  0.946975 2.189985 2.47582
H  -0.524213 3.168375 2.443514
H  0.346795 4.395333 0.440962
H  1.272773 4.612859 1.926877
H  2.348858 4.851456 -0.955738
H  3.186599 5.193655 0.568898
H  3.81105 3.947906 -0.522023
H  2.105561 1.576476 -2.131353
elementType: F O N C H
totalener: -1466.65820311 hartree
nucrepener: 2881.98940203 hartree
electener: -4348.64760514 hartree
oneelecener: -7744.43925703 hartree
twoeener: 3395.79165189 hartree
cpcmener: -0.04650937 hartree
kineticenergy: 1460.84067718 hartree
xcener: -133.539960507068 hartree
chargesum: -0.0000000
charge: -0.177455 -0.178627 -0.172865 -0.313272 -0.492361 -0.464731 -0.356762 -0.375157 -0.348710 0.249008 0.233575 -0.264908 -0.228400 -0.221045 0.141147 0.201018 -0.227171 0.387777 0.032012 0.128535 -0.129358 -0.033333 -0.144920 0.114013 0.496335 0.011935 0.024803 -0.113651 0.085325 0.070533 0.099641 0.098654 0.102710 0.091697 0.094215 0.102637 0.154997 0.108134 0.114906 0.154475 0.086146 0.101823 0.081210 0.089221 0.107139 0.103216 0.098574 0.277318
qa: -0.1775 -0.1786 -0.1729 -0.3133 -0.4924 -0.4647 -0.3568 -0.3752 -0.3487 0.2490 0.2336 -0.2649 -0.2284 -0.2210 0.1411 0.2010 -0.2272 0.3878 0.0320 0.1285 -0.1294 -0.0333 -0.1449 0.1140 0.4963 0.0119 0.0248 -0.1137 0.0853 0.0705 0.0996 0.0987 0.1027 0.0917 0.0942 0.1026 0.1550 0.1081 0.1149 0.1545 0.0861 0.1018 0.0812 0.0892 0.1071 0.1032 0.0986 0.2773
va: 1.1244 1.1135 1.1307 2.2392 1.9875 2.0282 1.9443 1.9295 3.1034 3.7048 3.6644 4.0711 3.9192 3.9430 3.9513 3.9702 3.3328 3.7876 3.5887 3.9427 4.0296 3.9817 3.9584 3.8648 4.5066 3.9184 3.9323 3.8878 1.0186 1.0269 1.0131 1.0075 1.0084 1.0463 1.0081 1.0064 1.0036 1.0176 0.9927 1.0043 0.9969 0.9994 1.0008 0.9977 0.9904 0.9929 0.9977 1.0507
dispcorr: -0.028314494 hartree
energy: -1466.686517599227
dipole: 51.69459 -47.98027 3.71433 27.07274 -25.76681 1.30594 9.72968 -9.52457 0.20511
magnitude: 3.94256 au
magnitude: 10.02119 debye
