program: Orca
programVersion: 5.0.2
elementType: F F F O O O O O N C C C C C C C C C C C C C C C C C C C H H H H H H H H H H H H H H H H H H H H
charge: 0
multiplicity: 1
keywords: wb97x-d3
keywords: def2-TZVPP
keywords: def2/J RIJCOSX
keywords: DEFGRID2
keywords: scfconv7
keywords: smallprint printgap noloewdin
keywords: NOSOSCF
formula: C19H20F3NO5
InChI: InChI=1/C19H20F3NO5/c1-27-6-7-28-9-13-12(4-5-14(23-13)19(20,21)22)18(26)15-16(24)10-2-3-11(8-10)17(15)25/h4-5,10-11,26H,2-3,6-9H2,1H3
48 atoms
F  5.182757 1.230235 -0.557778
F  4.720487 3.160099 0.269699
F  5.310446 1.545126 1.563143
O  -0.925725 1.577229 -1.1693
O  -3.108817 -1.057141 2.058275
O  -0.710961 -0.83016 2.271294
O  0.327158 -2.207467 -0.098087
O  -0.98524 -3.941322 -1.935115
N  2.94017 0.138054 0.463053
C  -3.298217 1.44246 -1.157775
C  -4.399491 0.111362 0.435661
C  -4.310452 1.562613 -0.024196
C  -3.80269 0.20719 -1.939037
C  -4.526048 -0.665349 -0.895501
C  -1.922435 1.149062 -0.607651
C  -3.110842 -0.264893 1.098834
C  -1.877746 0.296787 0.584378
C  -0.701281 -0.039226 1.246059
C  0.643903 0.499765 0.948046
C  1.715031 -0.33809 0.623143
C  0.887471 1.854032 1.113207
C  1.562487 -1.827948 0.444325
C  2.173496 2.341824 0.954909
C  3.160284 1.431058 0.629193
C  4.598599 1.847061 0.46968
C  0.20224 -1.927078 -1.480781
C  -1.074391 -2.536305 -1.99114
C  -2.170623 -4.566756 -2.367901
H  -3.233873 2.328435 -1.789257
H  -5.222762 -0.096451 1.118727
H  -4.006563 2.252958 0.764949
H  -5.275328 1.89749 -0.408586
H  -4.495289 0.539804 -2.711871
H  -2.995502 -0.322824 -2.445631
H  -4.117247 -1.674544 -0.829743
H  -5.583637 -0.768769 -1.136933
H  0.083918 2.526787 1.38142
H  2.398276 -2.186778 -0.166868
H  1.649757 -2.313813 1.41992
H  2.375986 3.394618 1.086679
H  1.063355 -2.326724 -2.031842
H  0.171836 -0.848494 -1.670084
H  -1.926697 -2.174593 -1.398462
H  -1.232253 -2.190016 -3.021445
H  -2.424071 -4.298772 -3.400139
H  -2.019449 -5.644857 -2.320526
H  -3.026522 -4.30881 -1.73284
H  -1.691408 -1.121526 2.403734
elementType: F O N C H
totalener: -1466.65656524 hartree
nucrepener: 2858.22223753 hartree
electener: -4324.87880277 hartree
oneelecener: -7694.77269235 hartree
twoeener: 3369.89388958 hartree
cpcmener: -0.04727573 hartree
kineticenergy: 1460.83738225 hartree
xcener: -133.542487891304 hartree
chargesum: -0.0000000
charge: -0.172800 -0.176357 -0.177627 -0.494754 -0.459322 -0.326911 -0.377880 -0.393575 -0.354329 0.257725 0.234842 -0.267270 -0.243277 -0.244418 0.199409 0.197801 -0.278258 0.413592 -0.012521 0.125230 -0.141431 0.025198 -0.118279 0.114121 0.493700 0.009008 0.044654 -0.110892 0.073405 0.076283 0.096686 0.096721 0.105704 0.097859 0.102883 0.105503 0.167030 0.104847 0.125474 0.152711 0.107951 0.102411 0.051237 0.089720 0.093023 0.119795 0.092165 0.273211
qa: -0.1728 -0.1764 -0.1776 -0.4948 -0.4593 -0.3269 -0.3779 -0.3936 -0.3543 0.2577 0.2348 -0.2673 -0.2433 -0.2444 0.1994 0.1978 -0.2783 0.4136 -0.0125 0.1252 -0.1414 0.0252 -0.1183 0.1141 0.4937 0.0090 0.0447 -0.1109 0.0734 0.0763 0.0967 0.0967 0.1057 0.0979 0.1029 0.1055 0.1670 0.1048 0.1255 0.1527 0.1080 0.1024 0.0512 0.0897 0.0930 0.1198 0.0922 0.2732
va: 1.1303 1.1265 1.1177 1.9688 2.0573 2.2174 1.9295 1.9286 3.0937 3.6668 3.7334 4.0631 3.9298 3.9633 3.9527 3.9942 3.3474 3.7421 3.5795 3.8391 3.9685 3.8574 3.9531 3.8831 4.5155 3.8823 3.9736 3.8986 1.0268 1.0259 1.0138 1.0061 1.0050 1.0172 1.0013 1.0068 0.9950 1.0196 0.9981 1.0048 1.0100 1.0000 0.9917 0.9942 0.9893 0.9919 0.9882 1.0703
dispcorr: -0.027960075 hartree
energy: -1466.684525314896
dipole: -51.57664 48.05607 -3.52057 -21.89228 22.97927 1.08699 -17.35670 16.76241 -0.59429
magnitude: 3.73218 au
magnitude: 9.48645 debye
