program: Orca
programVersion: 5.0.2
elementType: F F F O O O O O N C C C C C C C C C C C C C C C C C C C H H H H H H H H H H H H H H H H H H H H
charge: 0
multiplicity: 1
keywords: wb97x-d3
keywords: def2-TZVPP
keywords: def2/J RIJCOSX
keywords: DEFGRID2
keywords: scfconv7
keywords: smallprint printgap noloewdin
keywords: NOSOSCF
formula: C19H20F3NO5
InChI: InChI=1/C19H20F3NO5/c1-27-6-7-28-9-13-12(4-5-14(23-13)19(20,21)22)18(26)15-16(24)10-2-3-11(8-10)17(15)25/h4-5,10-11,26H,2-3,6-9H2,1H3
48 atoms
F  4.934625 1.827796 1.083941
F  5.386268 1.47272 -0.987389
F  4.530571 3.349143 -0.382209
O  -0.831339 1.283672 1.418478
O  -2.98762 -1.417758 -1.755691
O  -0.538016 -1.263285 -1.856925
O  0.406897 -1.9811 0.962886
O  -2.267188 -3.187476 0.944606
N  2.967992 0.219018 0.067063
C  -3.212945 1.299212 1.287077
C  -4.305494 -0.109026 -0.258014
C  -4.140116 0.086365 1.246227
C  -3.832531 2.245878 0.234149
C  -4.568252 1.32802 -0.761777
C  -1.832524 0.890856 0.839651
C  -3.007854 -0.582975 -0.83639
C  -1.785323 -0.002385 -0.32053
C  -0.591114 -0.374135 -0.913288
C  0.708768 0.284747 -0.656194
C  1.794071 -0.374806 -0.075503
C  0.881336 1.583172 -1.104405
C  1.686588 -1.786563 0.420386
C  2.114386 2.195892 -0.960577
C  3.119959 1.461897 -0.36371
C  4.497307 2.034088 -0.159935
C  0.162832 -3.328759 1.311669
C  -1.236148 -3.468504 1.864114
C  -2.421136 -4.167123 -0.058615
H  -3.141249 1.761711 2.271098
H  -5.098163 -0.802926 -0.536468
H  -3.738832 -0.790291 1.757757
H  -5.101718 0.329403 1.701275
H  -4.532869 2.91616 0.731926
H  -3.084252 2.875252 -0.249317
H  -4.24314 1.474573 -1.792121
H  -5.642331 1.511396 -0.739676
H  0.06017 2.116867 -1.564818
H  1.870879 -2.478371 -0.414138
H  2.47199 -1.968458 1.162541
H  2.26121 3.208626 -1.305756
H  0.86341 -3.658928 2.089316
H  0.319332 -3.98456 0.445382
H  -1.335071 -4.48743 2.260529
H  -1.36924 -2.780432 2.70216
H  -3.366603 -3.981738 -0.566583
H  -1.621887 -4.142505 -0.805824
H  -2.457231 -5.176886 0.366066
H  -1.494786 -1.569201 -2.021994
elementType: F O N C H
totalener: -1466.65565155 hartree
nucrepener: 2882.25079597 hartree
electener: -4348.90644752 hartree
oneelecener: -7744.69222086 hartree
twoeener: 3395.78577334 hartree
cpcmener: -0.04671453 hartree
kineticenergy: 1460.85512265 hartree
xcener: -133.544946397857 hartree
chargesum: -0.0000000
charge: -0.174352 -0.177114 -0.176876 -0.490105 -0.470834 -0.316687 -0.353780 -0.392216 -0.353158 0.237159 0.236684 -0.275514 -0.228404 -0.211516 0.204960 0.158581 -0.298510 0.458094 0.013996 0.141119 -0.134613 -0.033262 -0.112777 0.109874 0.496899 0.010992 0.015174 -0.127802 0.069619 0.076454 0.093902 0.100404 0.099149 0.094943 0.095041 0.099838 0.160664 0.119752 0.100203 0.152347 0.098860 0.097089 0.096292 0.090363 0.108564 0.100842 0.113495 0.276164
qa: -0.1744 -0.1771 -0.1769 -0.4901 -0.4708 -0.3167 -0.3538 -0.3922 -0.3532 0.2372 0.2367 -0.2755 -0.2284 -0.2115 0.2050 0.1586 -0.2985 0.4581 0.0140 0.1411 -0.1346 -0.0333 -0.1128 0.1099 0.4969 0.0110 0.0152 -0.1278 0.0696 0.0765 0.0939 0.1004 0.0991 0.0949 0.0950 0.0998 0.1607 0.1198 0.1002 0.1523 0.0989 0.0971 0.0963 0.0904 0.1086 0.1008 0.1135 0.2762
va: 1.1277 1.1204 1.1258 1.9837 2.0312 2.2271 1.9614 1.8909 3.1133 3.6596 3.7482 4.0379 3.9480 3.9448 4.0014 4.0023 3.3541 3.6719 3.5654 3.9635 3.9821 3.9937 3.9264 3.8797 4.5080 3.8440 3.9260 3.8946 1.0271 1.0249 1.0306 1.0071 1.0042 1.0106 1.0121 1.0035 0.9969 0.9924 1.0121 1.0048 0.9993 0.9900 1.0034 1.0030 0.9954 0.9827 0.9966 1.0595
dispcorr: -0.028424166 hartree
energy: -1466.684075711153
dipole: -49.59295 47.06833 -2.52462 -24.47609 23.61819 -0.85789 5.20022 -5.84713 -0.64692
magnitude: 2.74375 au
magnitude: 6.97407 debye
