program: Orca
programVersion: 5.0.2
elementType: F F F O O O O O N C C C C C C C C C C C C C C C C C C C H H H H H H H H H H H H H H H H H H H H
charge: 0
multiplicity: 1
keywords: wb97x-d3
keywords: def2-TZVPP
keywords: def2/J RIJCOSX
keywords: DEFGRID2
keywords: scfconv7
keywords: smallprint printgap noloewdin
keywords: NOSOSCF
formula: C19H20F3NO5
InChI: InChI=1/C19H20F3NO5/c1-27-6-7-28-9-13-12(4-5-14(23-13)19(20,21)22)18(26)15-16(24)10-2-3-11(8-10)17(15)25/h4-5,10-11,26H,2-3,6-9H2,1H3
48 atoms
F  4.756439 3.145222 0.498297
F  5.482696 1.170108 0.947466
F  5.010764 1.70778 -1.081087
O  -0.906911 1.887801 -0.772057
O  -2.913211 -1.441028 1.874229
O  -0.462496 -1.374553 1.777349
O  0.035114 -1.300753 -1.480784
O  -1.886903 -3.29423 -0.598416
N  2.871682 0.314517 -0.327206
C  -3.276285 1.656074 -0.761603
C  -4.294767 0.004259 0.574368
C  -4.247227 1.519684 0.406502
C  -3.764769 0.572392 -1.752445
C  -4.44984 -0.497666 -0.880926
C  -1.878821 1.304372 -0.318474
C  -2.975719 -0.476135 1.094371
C  -1.77732 0.191829 0.629135
C  -0.555008 -0.319307 1.028647
C  0.75781 0.306778 0.748496
C  1.671463 -0.219447 -0.166593
C  1.129901 1.405061 1.505764
C  1.355071 -1.418283 -1.010612
C  2.388979 1.954166 1.336969
C  3.215935 1.362873 0.401853
C  4.620412 1.854608 0.183719
C  -0.409177 -2.404561 -2.245728
C  -0.789259 -3.611313 -1.421963
C  -2.238304 -4.355342 0.256938
H  -3.262024 2.649444 -1.209582
H  -5.09114 -0.353707 1.226345
H  -3.925362 2.047974 1.305923
H  -5.231738 1.899874 0.12918
H  -4.473707 1.020677 -2.447959
H  -2.950352 0.163064 -2.352258
H  -4.027696 -1.492076 -1.027126
H  -5.512595 -0.567253 -1.111305
H  0.443954 1.830422 2.226608
H  2.070572 -1.470595 -1.8386
H  1.497831 -2.324184 -0.407003
H  2.694597 2.809888 1.921647
H  0.353317 -2.706876 -2.973202
H  -1.276319 -2.054989 -2.81084
H  -1.039348 -4.425725 -2.115741
H  0.059857 -3.965098 -0.821096
H  -2.478541 -5.267919 -0.300364
H  -1.435777 -4.593322 0.964352
H  -3.12121 -4.060011 0.821424
H  -1.416143 -1.666378 1.987644
elementType: F O N C H
totalener: -1466.65458359 hartree
nucrepener: 2889.16256155 hartree
electener: -4355.81714514 hartree
oneelecener: -7758.70084880 hartree
twoeener: 3402.88370366 hartree
cpcmener: -0.04656212 hartree
kineticenergy: 1460.86066758 hartree
xcener: -133.544357981595 hartree
chargesum: -0.0000000
charge: -0.177770 -0.178552 -0.172208 -0.493260 -0.471501 -0.316629 -0.359134 -0.376952 -0.346342 0.233542 0.228150 -0.262569 -0.226240 -0.219461 0.209554 0.153289 -0.268008 0.406450 0.047634 0.133781 -0.142578 -0.040346 -0.128376 0.121639 0.497988 0.002455 0.018772 -0.121502 0.071864 0.076236 0.098038 0.096982 0.102714 0.095374 0.086336 0.101308 0.159596 0.101556 0.125350 0.155159 0.099022 0.099445 0.097743 0.086696 0.106741 0.105615 0.101938 0.280462
qa: -0.1778 -0.1786 -0.1722 -0.4933 -0.4715 -0.3166 -0.3591 -0.3770 -0.3463 0.2335 0.2281 -0.2626 -0.2262 -0.2195 0.2096 0.1533 -0.2680 0.4065 0.0476 0.1338 -0.1426 -0.0403 -0.1284 0.1216 0.4980 0.0025 0.0188 -0.1215 0.0719 0.0762 0.0980 0.0970 0.1027 0.0954 0.0863 0.1013 0.1596 0.1016 0.1253 0.1552 0.0990 0.0994 0.0977 0.0867 0.1067 0.1056 0.1019 0.2805
va: 1.1248 1.1138 1.1319 1.9814 2.0343 2.2310 1.9441 1.9148 3.1096 3.6879 3.7217 4.0509 3.9406 3.9123 3.9917 4.0225 3.3827 3.7605 3.5525 3.9747 3.9979 3.9890 3.9504 3.8556 4.5034 3.9326 3.8662 3.8839 1.0275 1.0246 1.0126 1.0058 1.0049 1.0120 1.0427 1.0069 0.9976 1.0185 0.9858 1.0045 1.0032 0.9985 1.0016 0.9934 0.9944 0.9906 0.9987 1.0544
dispcorr: -0.028719807 hartree
energy: -1466.683303398508
dipole: -50.25086 47.70436 -2.54650 -26.54184 25.23684 -1.30500 -8.67586 9.05502 0.37916
magnitude: 2.88643 au
magnitude: 7.33671 debye
