program: Orca
programVersion: 5.0.2
elementType: F F F O O O O O N C C C C C C C C C C C C C C C C C C C H H H H H H H H H H H H H H H H H H H H
charge: 0
multiplicity: 1
keywords: wb97x-d3
keywords: def2-TZVPP
keywords: def2/J RIJCOSX
keywords: DEFGRID2
keywords: scfconv7
keywords: smallprint printgap noloewdin
keywords: NOSOSCF
formula: C19H20F3NO5
InChI: InChI=1/C19H20F3NO5/c1-27-6-7-28-9-13-12(4-5-14(23-13)19(20,21)22)18(26)15-16(24)10-2-3-11(8-10)17(15)25/h4-5,10-11,24H,2-3,6-9H2,1H3
48 atoms
F  -4.663194 -2.484158 -1.072359
F  -5.008226 -2.870755 1.017013
F  -5.483793 -0.947189 0.183873
O  0.882315 -1.968261 -0.741639
O  3.038552 1.333623 1.818963
O  0.586874 1.092481 2.050655
O  -0.158896 1.7156 -0.859037
O  0.596251 4.42068 -0.538792
N  -2.691794 -0.662563 -0.474195
C  3.232713 -1.639351 -0.973492
C  4.300357 -0.018224 0.344502
C  4.291501 -1.526559 0.118573
C  3.635995 -0.514028 -1.955936
C  4.364749 0.53766 -1.097036
C  1.867102 -1.335785 -0.39922
C  2.99615 0.373975 0.948761
C  1.807784 -0.240215 0.567625
C  0.579931 0.222281 1.171142
C  -0.746623 -0.397598 0.86297
C  -1.490101 -0.14498 -0.295973
C  -1.311236 -1.197626 1.840462
C  -0.966201 0.713294 -1.409789
C  -2.568038 -1.750559 1.641516
C  -3.209024 -1.448194 0.458654
C  -4.594466 -1.946922 0.147737
C  0.627727 2.405627 -1.801783
C  1.448097 3.447023 -1.088239
C  1.281224 5.353597 0.255866
H  3.198771 -2.617078 -1.454066
H  5.117057 0.340282 0.971129
H  4.061336 -2.100211 1.018187
H  5.263541 -1.858611 -0.25105
H  4.305441 -0.925718 -2.711553
H  2.778137 -0.102195 -2.489484
H  3.929479 1.534272 -1.180446
H  5.4122 0.624799 -1.386502
H  -0.773473 -1.406423 2.756547
H  -0.400663 0.082707 -2.111688
H  -1.811124 1.130624 -1.971044
H  -3.011699 -2.380037 2.39924
H  -0.003067 2.877176 -2.567187
H  1.308076 1.719631 -2.32432
H  2.056891 2.971826 -0.305501
H  2.14941 3.889827 -1.810048
H  1.791273 4.878453 1.103119
H  2.030077 5.917971 -0.313745
H  0.55117 6.060089 0.651372
H  2.092285 1.494415 2.129746
elementType: F O N C H
totalener: -1466.66290205 hartree
nucrepener: 2861.55302962 hartree
electener: -4328.21593167 hartree
oneelecener: -7702.08654743 hartree
twoeener: 3373.87061575 hartree
cpcmener: -0.04249079 hartree
kineticenergy: 1460.84844296 hartree
xcener: -133.540213826519 hartree
chargesum: 0.0000000
charge: -0.174230 -0.177742 -0.176931 -0.460349 -0.311145 -0.443194 -0.339045 -0.376551 -0.346416 0.241338 0.255012 -0.272964 -0.244936 -0.232115 0.191910 0.141533 -0.254874 0.407486 0.046027 0.127387 -0.136712 -0.051730 -0.137196 0.106706 0.495895 0.009140 0.019134 -0.111147 0.071995 0.084130 0.098504 0.097672 0.104433 0.104696 0.096536 0.103707 0.150420 0.110341 0.107041 0.150973 0.105486 0.088401 0.067565 0.097090 0.088942 0.089642 0.116896 0.271241
qa: -0.1742 -0.1777 -0.1769 -0.4603 -0.3111 -0.4432 -0.3390 -0.3766 -0.3464 0.2413 0.2550 -0.2730 -0.2449 -0.2321 0.1919 0.1415 -0.2549 0.4075 0.0460 0.1274 -0.1367 -0.0517 -0.1372 0.1067 0.4959 0.0091 0.0191 -0.1111 0.0720 0.0841 0.0985 0.0977 0.1044 0.1047 0.0965 0.1037 0.1504 0.1103 0.1070 0.1510 0.1055 0.0884 0.0676 0.0971 0.0889 0.0896 0.1169 0.2712
va: 1.1283 1.1247 1.1197 2.0305 2.2434 2.0587 1.9629 1.9289 3.1130 3.6377 3.6884 4.0745 3.9416 3.9445 3.9961 3.9542 3.3502 3.7616 3.5864 3.9549 4.0410 4.0225 3.9303 3.8806 4.5128 3.8961 3.9643 3.9100 1.0265 1.0194 1.0128 1.0074 1.0068 1.0042 1.0187 1.0080 1.0047 0.9927 1.0159 1.0052 1.0057 0.9977 0.9947 0.9976 0.9923 0.9884 0.9920 1.0597
dispcorr: -0.027977913 hartree
energy: -1466.690879962849
dipole: 52.44974 -47.87101 4.57873 26.31315 -25.95974 0.35340 -9.55917 9.50764 -0.05153
magnitude: 4.59264 au
magnitude: 11.67355 debye
