program: Orca
programVersion: 5.0.2
elementType: F F F O O O O O N C C C C C C C C C C C C C C C C C C C H H H H H H H H H H H H H H H H H H H H
charge: 0
multiplicity: 1
keywords: wb97x-d3
keywords: def2-TZVPP
keywords: def2/J RIJCOSX
keywords: DEFGRID2
keywords: scfconv7
keywords: smallprint printgap noloewdin
keywords: NOSOSCF
formula: C19H20F3NO5
InChI: InChI=1/C19H20F3NO5/c1-27-6-7-28-9-13-12(4-5-14(23-13)19(20,21)22)18(26)15-16(24)10-2-3-11(8-10)17(15)25/h4-5,10-11,24H,2-3,6-9H2,1H3
48 atoms
F  -5.270319 -2.527015 -0.98388
F  -4.258344 -3.232777 0.780273
F  -5.273749 -1.338739 0.808653
O  0.732123 -1.882605 0.672522
O  2.894089 1.576971 -1.663982
O  0.515874 1.060273 -2.235444
O  -0.451184 2.004451 0.544726
O  1.853521 4.718041 1.202198
N  -2.741677 -0.603768 0.469692
C  3.01686 -1.38596 1.130697
C  4.05057 0.410357 0.036668
C  3.673723 -0.045113 1.440896
C  3.998803 -2.029497 0.119996
C  4.728638 -0.849467 -0.550333
C  1.684069 -1.152371 0.456291
C  2.80451 0.669261 -0.740077
C  1.640359 -0.049753 -0.505725
C  0.459787 0.288843 -1.272492
C  -0.861993 -0.332366 -0.958109
C  -1.579921 -0.036155 0.205335
C  -1.424216 -1.204375 -1.872916
C  -1.062354 0.938445 1.221419
C  -2.643189 -1.801959 -1.588293
C  -3.246602 -1.47426 -0.389636
C  -4.523504 -2.137967 0.053033
C  0.428997 2.755017 1.347179
C  0.916124 3.929203 0.511717
C  3.158415 4.189031 1.207546
H  2.855555 -2.015098 2.00611
H  4.694584 1.28977 0.001921
H  3.017598 0.65326 1.964233
H  4.570409 -0.183683 2.047666
H  4.702124 -2.664325 0.658961
H  3.487499 -2.669243 -0.60021
H  4.684919 -0.88047 -1.639192
H  5.783429 -0.831854 -0.274558
H  -0.908191 -1.442917 -2.794364
H  -1.892424 1.279846 1.850457
H  -0.351338 0.426421 1.88547
H  -3.08629 -2.498033 -2.286582
H  1.265868 2.125723 1.680444
H  -0.077177 3.125869 2.24829
H  1.326711 3.566013 -0.439477
H  0.069548 4.577648 0.271976
H  3.531405 4.012657 0.191787
H  3.809651 4.922792 1.683386
H  3.242319 3.253836 1.771985
H  2.016858 1.599634 -2.150996
elementType: F O N C H
totalener: -1466.65877730 hartree
nucrepener: 2865.19228323 hartree
electener: -4331.85106053 hartree
oneelecener: -7708.31835449 hartree
twoeener: 3376.46729396 hartree
cpcmener: -0.03993004 hartree
kineticenergy: 1460.85211908 hartree
xcener: -133.541680676533 hartree
chargesum: 0.0000000
charge: -0.178085 -0.178003 -0.170089 -0.456683 -0.310756 -0.442242 -0.353968 -0.388179 -0.339614 0.247966 0.221218 -0.291944 -0.231985 -0.205940 0.159015 0.142862 -0.202184 0.346829 0.061554 0.116408 -0.122974 -0.050594 -0.153066 0.117091 0.497151 0.012075 0.044445 -0.109217 0.073294 0.093454 0.109975 0.099973 0.099577 0.096469 0.096830 0.100832 0.151525 0.106029 0.117481 0.152785 0.070647 0.107660 0.072025 0.102561 0.088356 0.121805 0.086788 0.270840
qa: -0.1781 -0.1780 -0.1701 -0.4567 -0.3108 -0.4422 -0.3540 -0.3882 -0.3396 0.2480 0.2212 -0.2919 -0.2320 -0.2059 0.1590 0.1429 -0.2022 0.3468 0.0616 0.1164 -0.1230 -0.0506 -0.1531 0.1171 0.4972 0.0121 0.0444 -0.1092 0.0733 0.0935 0.1100 0.1000 0.0996 0.0965 0.0968 0.1008 0.1515 0.1060 0.1175 0.1528 0.0706 0.1077 0.0720 0.1026 0.0884 0.1218 0.0868 0.2708
va: 1.1232 1.1137 1.1350 2.0300 2.2407 2.0571 1.9575 1.9337 3.1045 3.6535 3.7079 4.0747 3.9564 3.9522 4.0201 3.9534 3.2970 3.8563 3.5764 3.9244 4.0292 4.0298 3.9755 3.8632 4.5039 3.8315 3.9009 3.9274 1.0277 1.0151 1.0061 1.0094 1.0039 1.0096 1.0132 1.0045 1.0049 1.0180 0.9871 1.0053 0.9985 1.0050 1.0176 0.9997 0.9957 0.9934 0.9769 1.0562
dispcorr: -0.029135292 hartree
energy: -1466.687912589486
dipole: 54.08477 -50.05945 4.02532 23.14940 -23.21080 -0.06140 6.96691 -7.12570 -0.15879
magnitude: 4.02892 au
magnitude: 10.24070 debye
